{"text_format":"3","workbook":"xlsx","n_sheets":12,"sheets":["Deckblatt ","PPF Abstimmung","PPF-Bewertung","Prozessbez. Nachweise","Sprachen","Erklärung Produktnachweise","Produktbez. Nachweise ","Selbstb. Produkt ","Selbstb. Prozess","Anlage 5 Deckblatt Software 1","Anlage 5 Deckblatt Software 2","Anlage 6 Teilelebenslauf"],"not_rendered":{"external_links":13,"defined_names":1995,"comments":3},"read":"whole","date_system":"1900"}

{"sheet":"Deckblatt ","index":0,"n_rows":42,"n_cols":42,"rows_kept":42,"merged":[[0,0,1,12],[0,13,0,39],[1,13,1,19],[1,20,1,39],[2,0,2,19],[2,20,2,39],[3,0,3,19],[3,20,3,21],[3,22,3,39],[4,0,5,19],[4,20,4,21],[4,22,4,39],[5,20,5,21],[5,22,5,39],[6,0,6,19],[6,20,6,39],[7,0,7,19],[7,20,7,21],[7,22,7,39],[8,0,8,19],[8,20,8,21],[8,22,8,39],[9,0,9,19],[9,20,9,21],[9,22,9,39],[10,0,11,19],[10,20,10,21],[10,22,10,39],[11,20,11,21],[11,22,11,39],[12,0,12,19],[12,20,12,21],[12,22,12,39],[13,0,13,19],[13,20,13,21],[13,22,13,39],[14,0,14,13],[14,14,14,26],[14,27,14,39],[15,0,15,6],[15,7,15,13],[15,14,15,20],[15,21,15,26],[15,27,16,33],[15,34,16,39],[16,0,16,6],[16,7,16,13],[16,14,16,20],[16,21,16,26],[17,0,17,6],[17,7,17,13],[17,14,17,20],[17,21,17,26],[17,27,17,33],[17,34,17,39],[18,0,18,6],[18,7,18,13],[18,14,18,20],[18,21,18,26],[18,27,18,33],[18,34,18,39],[19,0,19,6],[19,7,19,13],[19,14,19,20],[19,21,19,26],[19,27,19,33],[19,34,19,39],[20,0,20,6],[20,7,20,13],[20,14,20,20],[20,21,20,26],[20,27,20,33],[20,34,20,39],[21,0,21,6],[21,7,21,13],[21,14,21,20],[21,21,21,26],[21,27,21,33],[21,34,21,39],[22,0,22,6],[22,7,22,13],[22,14,22,20],[22,21,22,26],[22,27,22,33],[22,34,22,39],[23,0,23,13],[23,14,23,20],[23,21,23,26],[23,27,23,33],[23,34,23,39],[24,0,24,39],[25,0,25,39],[26,0,26,2],[26,3,26,21],[26,22,26,39],[27,0,27,7],[27,8,27,20],[27,21,30,25],[27,26,30,39],[28,0,28,7],[28,8,28,20],[29,0,29,7],[29,8,29,20],[30,0,30,7],[30,8,30,20],[31,0,31,7],[31,8,31,20],[31,21,31,25],[31,26,31,39],[32,0,32,39],[33,0,33,17],[33,18,33,19],[33,20,33,37],[33,38,33,39],[34,0,34,17],[34,18,34,19],[34,20,35,37],[34,38,35,39],[35,0,35,17],[35,18,35,19],[36,0,36,17],[36,18,36,39],[37,0,37,7],[37,8,37,20],[37,21,40,25],[37,26,40,39],[38,0,38,7],[38,8,38,20],[39,0,39,7],[39,8,39,20],[40,0,40,7],[40,8,40,20],[41,0,41,7],[41,8,41,20],[41,21,41,25],[41,26,41,39]]}
[{"$f":"Sprachen!L93","v":"Deckblatt zum \nPPF-Bericht"},{"$nulls":12},"F 14-5-19 / F14-5-19e Index 9 ",{"$nulls":27},"Sprachauswahl"]
[{"$nulls":13},{"$f":"Sprachen!L255","v":"Organisation"},{"$nulls":27},"Deutsch"]
[{"$f":"Sprachen!L254","v":"Organisation"},{"$nulls":19},{"$f":"Sprachen!L159","v":"Grund der Berichterstellung"}]
[{"$nulls":22},{"$f":"Sprachen!L71","v":"Bericht Produktionsprozess- und Produktfreigabe (PPF)"},{"$nulls":17},{"$f":"COUNTIF(U4:V6,\"X\")","v":0}]
[{"$nulls":22},{"$f":"Sprachen!L72","v":"Bericht sonstige Muster"}]
[{"$nulls":22},{"$f":"Sprachen!L301","v":"Requalifikation"}]
[{"$nulls":20},{"$f":"Sprachen!L55","v":"Auslöser PPF-Verfahren"},{"$nulls":19},{"$f":"COUNTIF(U8:V14,\"X\")","v":0}]
[{"$nulls":22},{"$f":"Sprachen!L218","v":"Mustervorstellung"}]
[{"$f":"Sprachen!L188","v":"Kunde (Empfänger)"},{"$nulls":21},{"$f":"Sprachen!L239","v":"Neuteil"}]
[{"$nulls":22},{"$f":"Sprachen!L36","v":"Änderungen am Produkt"}]
[{"$nulls":22},{"$f":"Sprachen!L37","v":"Änderungen am Produktionsprozess"}]
[{"$nulls":22},{"$f":"Sprachen!L35","v":"Änderung in der Lieferkette"}]
[{"$nulls":22},{"$f":"Sprachen!L373","v":"Wiedernutzung > 12 Monate Stillstand"}]
[{"$nulls":22},{"$f":"Sprachen!L24","v":"Aktualisierte PPF-Dokumentation"}]
[{"$f":"Sprachen!L46","v":"Angaben zur Organisation"},{"$nulls":13},{"$f":"Sprachen!L44","v":"Angaben zu Mustern"},{"$nulls":12},{"$f":"Sprachen!L45","v":"Angaben zum Kunden"}]
[{"$f":"Sprachen!L75","v":"Berichtsnummer"},{"$nulls":13},{"$f":"Sprachen!L198","v":"Lieferscheinnummer"},{"$nulls":12},{"$f":"Sprachen!L187","v":"Kunde"},{"$nulls":6},{"$f":"IF(A10<>\"\",A10,\"\")","v":""}]
[{"$f":"Sprachen!L77","v":"Berichtsversion"},{"$nulls":13},{"$f":"Sprachen!L197","v":"Liefermenge"}]
[{"$f":"Sprachen!L199","v":"Lieferstandort"},{"$nulls":13},{"$f":"Sprachen!L89","v":"Chargennummer"},{"$nulls":12},{"$f":"Sprachen!L87","v":"Bestellnr. PPF-Muster"}]
[{"$f":"Sprachen!L276","v":"Produktionsstandort"},{"$nulls":13},{"$f":"Sprachen!L217","v":"Mustergewicht [kg]"},{"$nulls":12},{"$f":"Sprachen!L14","v":"Abladestelle"}]
[{"$f":"Sprachen!L304","v":"Sachnummer"},{"$nulls":13},{"$f":"Sprachen!L166","v":"Hardwarestand"},{"$nulls":12},{"$f":"Sprachen!L304","v":"Sachnummer"}]
[{"$f":"Sprachen!L65","v":"Benennung"},{"$nulls":13},{"$f":"Sprachen!L98","v":"Diagnosestand"},{"$nulls":12},{"$f":"Sprachen!L65","v":"Benennung"}]
[{"$f":"Sprachen!L374","v":"Zeichnungsnummer"},{"$nulls":13},{"$f":"Sprachen!L326","v":"Softwarestand"},{"$nulls":12},{"$f":"Sprachen!L374","v":"Zeichnungsnummer"}]
[{"$f":"Sprachen!L361","v":"Version/ Datum"},{"$nulls":13},{"$f":"Sprachen!L177","v":"Kennung/DUNS"},{"$nulls":12},{"$f":"Sprachen!L361","v":"Version/ Datum"}]
["-",{"$nulls":13},{"$f":"Sprachen!L163","v":"Hardwarefreigabe"},{"$nulls":12},{"$f":"Sprachen!L324","v":"Softwarefreigabe"}]
[{"$f":"Sprachen!L84","v":"Bestätigung Organisation"}]
[{"$f":"Sprachen!L85","v":"Hiermit wird bestätigt, dass das PPF-Verfahren entsprechend den Vereinbarungen der Abstimmung zum PPF-Verfahren und nach den Vorgaben gemäß VDA Band 2 durchgeführt wurde."}]
[{"$nulls":3},{"$f":"Sprachen!L95","v":"Der IMDS-Datensatz wurde erstellt unter der MDB-ID-Nr.:"}]
[{"$f":"Sprachen!L234","v":"Name"},{"$nulls":20},{"$f":"Sprachen!L61","v":"Bemerkung"}]
[{"$f":"Sprachen!L20","v":"Abteilung"}]
[{"$f":"Sprachen!L343","v":"Telefon"}]
[{"$f":"Sprachen!L120","v":"E-Mail/Fax-Nr."}]
[{"$f":"Sprachen!L91","v":"Datum"},{"$nulls":20},{"$f":"Sprachen!L348","v":"Unterschrift"}]
[{"$f":"Sprachen!L124","v":"Entscheidung Kunde"}]
[{"$f":"Sprachen!L191","v":"Kundentauglich/Serientauglich"},{"$nulls":19},{"$f":"Sprachen!L243","v":"Nicht kundentauglich/\n Nicht serientauglich"}]
[{"$f":"Sprachen!L268","v":"PPF-Verfahren zum Kunden abgeschlossen"},{"$nulls":19},{"$f":"Sprachen!L238","v":"Neues PPF-Verfahren erforderlich"},{"$nulls":19},{"$f":"COUNTIF(S35:T36,\"X\")+COUNTIF(AM35,\"X\")","v":0}]
[{"$f":"Sprachen!L26","v":"Aktualisierung der PPF-Dokumentation erforderlich"}]
[{"$f":"Sprachen!L76 & \" \" &Sprachen!L187","v":"Berichtsnummer/-version Kunde"}]
[{"$f":"Sprachen!L234","v":"Name"},{"$nulls":20},{"$f":"Sprachen!L61","v":"Bemerkung"}]
[{"$f":"Sprachen!L20","v":"Abteilung"}]
[{"$f":"Sprachen!L343","v":"Telefon"}]
[{"$f":"Sprachen!L120","v":"E-Mail/Fax-Nr."}]
[{"$f":"Sprachen!L91","v":"Datum"},{"$nulls":20},{"$f":"Sprachen!L348","v":"Unterschrift"}]

{"sheet":"PPF Abstimmung","index":1,"n_rows":274,"n_cols":53,"rows_kept":274,"merged":[[0,0,1,12],[0,13,0,19],[0,20,0,26],[0,27,0,36],[0,37,0,41],[1,13,1,19],[1,20,1,41],[2,0,2,41],[3,0,3,19],[3,20,3,41],[4,0,4,6],[4,7,4,19],[4,20,4,26],[4,27,4,41],[5,0,5,6],[5,7,5,19],[5,20,5,26],[5,27,5,41],[6,0,6,6],[6,7,6,19],[6,20,6,26],[6,27,6,41],[7,0,7,6],[7,7,7,19],[7,20,7,26],[7,27,7,41],[8,0,8,6],[8,7,8,19],[8,20,8,26],[8,27,8,41],[9,0,9,6],[9,7,9,19],[9,20,9,26],[9,27,9,41],[10,0,10,6],[10,7,10,19],[10,20,10,26],[10,27,10,41],[11,0,11,6],[11,7,11,19],[11,20,11,26],[11,27,11,41],[12,0,12,41],[13,0,20,1],[13,2,13,6],[13,7,13,19],[13,20,13,26],[13,27,13,41],[14,2,14,6],[14,7,14,19],[14,20,14,26],[14,27,14,41],[15,2,15,6],[15,7,15,19],[15,20,15,26],[15,27,15,41],[16,2,16,6],[16,7,16,19],[16,20,16,26],[16,27,16,41],[17,2,17,6],[17,7,17,19],[17,20,17,26],[17,27,17,41],[18,2,18,6],[18,7,18,19],[18,20,18,26],[18,27,18,41],[19,2,19,6],[19,7,19,19],[19,20,19,26],[19,27,19,41],[20,2,20,6],[20,7,20,19],[20,20,20,26],[20,27,20,41],[21,0,28,1],[21,2,21,6],[21,7,21,19],[21,20,21,26],[21,27,21,41],[22,2,22,6],[22,7,22,19],[22,20,22,26],[22,27,22,41],[23,2,23,6],[23,7,23,19],[23,20,23,26],[23,27,23,41],[24,2,24,6],[24,7,24,19],[24,20,24,26],[24,27,24,41],[25,2,25,6],[25,7,25,19],[25,20,25,26],[25,27,25,41],[26,2,26,6],[26,7,26,19],[26,20,26,26],[26,27,26,41],[27,2,27,6],[27,7,27,19],[27,20,27,26],[27,27,27,41],[28,2,28,6],[28,7,28,19],[28,20,28,26],[28,27,28,41],[29,0,29,41],[30,0,30,19],[30,20,30,41],[31,0,31,6],[31,7,31,19],[31,20,31,26],[31,27,31,41],[32,0,32,6],[32,7,32,19],[32,20,32,26],[32,27,32,41],[33,0,33,6],[33,7,33,19],[33,20,33,26],[33,27,33,41],[34,0,34,6],[34,7,34,19],[34,20,34,26],[34,27,34,41],[35,0,35,6],[35,7,35,19],[35,20,35,26],[35,27,35,41],[36,0,36,6],[36,7,36,19],[36,20,36,26],[36,27,36,41],[37,0,37,13],[38,0,38,41],[39,0,39,1],[39,2,39,19],[39,20,39,41],[40,0,48,1],[40,2,40,10],[40,11,40,15],[40,16,40,19],[40,20,40,32],[40,33,40,37],[40,38,40,41],[41,2,41,10],[41,11,41,15],[41,16,41,19],[41,20,41,32],[41,33,41,37],[41,38,41,41],[42,2,42,10],[42,11,42,15],[42,16,42,19],[42,20,42,32],[42,33,42,37],[42,38,42,41],[43,2,43,10],[43,11,43,15],[43,16,43,19],[43,20,43,32],[43,33,43,37],[43,38,43,41],[44,2,44,10],[44,11,44,15],[44,16,44,19],[44,20,44,32],[44,33,44,37],[44,38,44,41],[45,2,45,10],[45,11,45,15],[45,16,45,19],[45,20,45,32],[45,33,45,37],[45,38,45,41],[46,2,46,10],[46,11,46,15],[46,16,46,19],[46,20,46,32],[46,33,46,37],[46,38,46,41],[47,2,47,10],[47,11,47,15],[47,16,47,19],[47,20,47,32],[47,33,47,37],[47,38,47,41],[48,2,48,10],[48,11,48,15],[48,16,48,19],[48,20,48,32],[48,33,48,37],[48,38,48,41],[49,0,49,41],[50,0,50,1],[50,2,50,41],[51,0,52,1],[51,2,51,10],[51,11,51,15],[51,16,51,19],[51,20,51,32],[51,33,51,37],[51,38,51,41],[52,2,52,10],[52,11,52,15],[52,16,52,19],[52,20,52,32],[52,33,52,37],[52,38,52,41],[53,0,53,41],[54,0,54,1],[54,2,54,19],[54,20,54,41],[55,0,62,1],[55,2,55,10],[55,11,55,15],[55,16,55,19],[55,20,55,32],[55,33,55,37],[55,38,55,41],[56,2,56,10],[56,11,56,15],[56,16,56,19],[56,20,56,32],[56,33,56,37],[56,38,56,41],[57,2,57,10],[57,11,57,15],[57,16,57,19],[57,20,57,32],[57,33,57,37],[57,38,57,41],[58,2,58,10],[58,11,58,15],[58,16,58,19],[58,20,58,32],[58,33,58,37],[58,38,58,41],[59,2,59,10],[59,11,59,15],[59,16,59,19],[59,20,59,32],[59,33,59,37],[59,38,59,41],[60,2,60,10],[60,11,60,15],[60,16,60,19],[60,20,60,32],[60,33,60,37],[60,38,60,41],[61,2,61,10],[61,11,61,15],[61,16,61,19],[61,20,61,32],[61,33,61,37],[61,38,61,41],[62,2,62,10],[62,11,62,15],[62,16,62,19],[62,20,62,32],[62,33,62,37],[62,38,62,41],[63,0,63,1],[63,2,63,19],[63,20,63,41],[64,0,71,1],[64,2,64,10],[64,11,64,15],[64,16,64,19],[64,20,64,32],[64,33,64,37],[64,38,64,41],[65,2,65,10],[65,11,65,15],[65,16,65,19],[65,20,65,32],[65,33,65,37],[65,38,65,41],[66,2,66,10],[66,11,66,15],[66,16,66,19],[66,20,66,32],[66,33,66,37],[66,38,66,41],[67,2,67,10],[67,11,67,15],[67,16,67,19],[67,20,67,32],[67,33,67,37],[67,38,67,41],[68,2,68,10],[68,11,68,15],[68,16,68,19],[68,20,68,32],[68,33,68,37],[68,38,68,41],[69,2,69,10],[69,11,69,15],[69,16,69,19],[69,20,69,32],[69,33,69,37],[69,38,69,41],[70,2,70,10],[70,11,70,15],[70,16,70,19],[70,20,70,32],[70,33,70,37],[70,38,70,41],[71,2,71,10],[71,11,71,15],[71,16,71,19],[71,20,71,32],[71,33,71,37],[71,38,71,41],[72,0,72,41],[73,0,73,19],[73,20,73,41],[74,0,74,1],[74,2,74,19],[74,20,74,21],[74,23,74,41],[75,0,75,1],[75,2,75,19],[75,20,75,21],[75,23,75,41],[76,0,76,1],[76,2,76,19],[76,20,76,21],[76,23,76,41],[77,0,77,19],[77,20,77,21],[77,23,77,41],[78,0,78,1],[78,2,78,9],[78,10,78,11],[78,12,78,19],[78,20,78,21],[78,23,78,41],[79,0,79,1],[79,2,79,9],[79,10,79,11],[79,12,79,19],[79,20,79,21],[79,23,79,41],[80,0,80,1],[80,2,80,5],[80,6,80,19],[80,20,80,21],[80,23,80,41],[81,0,81,41],[82,2,82,41],[83,0,83,41],[84,0,84,1],[84,2,84,41],[85,2,85,41],[86,2,90,41],[91,2,91,41],[92,2,92,41],[92,43,96,43],[93,2,93,41],[94,2,94,41],[95,2,95,41],[96,2,96,41],[97,0,97,41],[98,0,98,13],[98,14,98,41],[99,0,99,6],[99,7,99,13],[99,14,99,20],[99,21,99,26],[99,27,99,35],[99,36,99,41],[100,0,100,6],[100,7,100,13],[100,14,100,20],[100,21,100,26],[100,27,100,35],[100,36,100,41],[101,0,101,13],[101,14,101,26],[101,27,101,41],[102,0,102,6],[102,7,102,13],[102,14,102,20],[102,21,102,26],[102,27,102,41],[103,0,103,1],[103,2,103,41],[104,0,104,1],[104,2,104,7],[104,8,104,20],[104,21,104,25],[104,26,104,41],[105,0,105,2],[105,3,105,41],[106,0,106,2],[106,3,106,11],[106,12,106,16],[106,17,106,21],[106,22,106,41],[107,0,107,2],[107,3,107,11],[107,12,107,16],[107,17,107,21],[107,22,107,41],[108,0,108,2],[108,3,108,11],[108,12,108,16],[108,17,108,21],[108,22,108,41],[109,0,109,2],[109,3,109,11],[109,12,109,16],[109,17,109,21],[109,22,109,41],[110,0,110,2],[110,3,110,11],[110,12,110,16],[110,17,110,21],[110,22,110,41],[111,0,111,2],[111,3,111,11],[111,12,111,16],[111,17,111,21],[111,22,111,41],[112,0,112,2],[112,3,112,11],[112,12,112,16],[112,17,112,21],[112,22,112,41],[113,0,113,2],[113,3,113,11],[113,12,113,16],[113,17,113,21],[113,22,113,41],[114,0,114,2],[114,3,114,11],[114,12,114,16],[114,17,114,21],[114,22,114,41],[115,0,115,2],[115,3,115,11],[115,12,115,16],[115,17,115,21],[115,22,115,41],[116,0,116,2],[116,3,116,11],[116,12,116,16],[116,17,116,21],[116,22,116,41],[117,0,117,2],[117,3,117,11],[117,12,117,16],[117,17,117,21],[117,22,117,41],[118,0,118,2],[118,3,118,11],[118,12,118,16],[118,17,118,21],[118,22,118,41],[119,0,119,2],[119,3,119,11],[119,12,119,16],[119,17,119,21],[119,22,119,41],[120,0,120,2],[120,3,120,11],[120,12,120,16],[120,17,120,21],[120,22,120,41],[121,0,121,2],[121,3,121,11],[121,12,121,16],[121,17,121,21],[121,22,121,41],[122,0,122,2],[122,3,122,11],[122,12,122,16],[122,17,122,21],[122,22,122,41],[123,0,123,2],[123,3,123,11],[123,12,123,16],[123,17,123,21],[123,22,123,41],[124,0,124,2],[124,3,124,11],[124,12,124,16],[124,17,124,21],[124,22,124,41],[125,0,125,41],[126,0,126,2],[126,3,126,11],[126,12,126,26],[126,27,126,41],[127,0,127,2],[127,3,127,11],[127,12,127,26],[127,27,127,41],[128,0,128,2],[128,3,128,11],[128,12,128,26],[128,27,128,41],[129,0,129,41],[130,0,131,2],[130,3,131,5],[130,6,131,11],[130,12,131,13],[130,14,131,15],[130,16,131,17],[130,18,131,19],[130,20,130,27],[130,28,131,29],[130,30,131,41],[131,20,131,21],[131,22,131,23],[131,24,131,25],[131,26,131,27],[132,0,132,2],[132,3,132,11],[132,12,132,13],[132,14,132,15],[132,16,132,17],[132,18,132,19],[132,20,132,21],[132,22,132,23],[132,24,132,25],[132,26,132,27],[132,28,132,29],[132,30,132,41],[132,47,133,47],[132,48,133,48],[132,49,133,49],[132,50,133,50],[133,0,133,2],[133,3,133,11],[133,12,133,13],[133,14,133,15],[133,16,133,17],[133,18,133,19],[133,20,133,21],[133,22,133,23],[133,24,133,25],[133,26,133,27],[133,28,133,29],[133,30,133,41],[134,0,134,17],[134,18,134,26],[135,0,135,2],[135,3,135,41],[136,0,136,2],[136,3,136,11],[136,12,136,13],[136,14,136,15],[136,16,136,17],[136,18,136,19],[136,20,136,21],[136,22,136,23],[136,24,136,25],[136,26,136,27],[136,28,136,29],[136,30,136,41],[136,47,140,47],[136,48,140,48],[136,49,140,49],[136,50,140,50],[137,0,137,2],[137,3,137,11],[137,12,137,13],[137,14,137,15],[137,16,137,17],[137,18,137,19],[137,20,137,21],[137,22,137,23],[137,24,137,25],[137,26,137,27],[137,28,137,29],[137,30,137,41],[138,0,138,2],[138,3,138,11],[138,12,138,13],[138,14,138,15],[138,16,138,17],[138,18,138,19],[138,20,138,21],[138,22,138,23],[138,24,138,25],[138,26,138,27],[138,28,138,29],[138,30,138,41],[139,0,139,2],[139,3,139,11],[139,12,139,13],[139,14,139,15],[139,16,139,17],[139,18,139,19],[139,20,139,21],[139,22,139,23],[139,24,139,25],[139,26,139,27],[139,28,139,29],[139,30,139,41],[140,0,140,2],[140,3,140,11],[140,12,140,13],[140,14,140,15],[140,16,140,17],[140,18,140,19],[140,20,140,21],[140,22,140,23],[140,24,140,25],[140,26,140,27],[140,28,140,29],[140,30,140,41],[141,0,141,2],[141,3,141,41],[142,0,142,2],[142,3,142,11],[142,12,142,13],[142,14,142,15],[142,16,142,17],[142,18,142,19],[142,20,142,21],[142,22,142,23],[142,24,142,25],[142,26,142,27],[142,28,142,29],[142,30,142,41],[142,47,144,47],[142,48,144,48],[142,49,144,49],[142,50,144,50],[143,0,143,2],[143,3,143,11],[143,12,143,13],[143,14,143,15],[143,16,143,17],[143,18,143,19],[143,20,143,21],[143,22,143,23],[143,24,143,25],[143,26,143,27],[143,28,143,29],[143,30,143,41],[144,0,144,2],[144,3,144,11],[144,12,144,13],[144,14,144,15],[144,16,144,17],[144,18,144,19],[144,20,144,21],[144,22,144,23],[144,24,144,25],[144,26,144,27],[144,28,144,29],[144,30,144,41],[145,0,145,2],[145,3,145,41],[146,0,146,2],[146,3,146,11],[146,12,153,13],[146,14,153,15],[146,16,146,25],[146,26,146,27],[146,28,146,29],[146,30,146,41],[146,47,177,47],[146,48,177,48],[146,49,177,49],[146,50,177,50],[147,0,147,2],[147,4,147,11],[147,16,147,17],[147,18,147,19],[147,20,147,21],[147,22,147,23],[147,24,147,25],[147,26,147,27],[147,28,147,29],[147,30,147,41],[148,0,148,2],[148,4,148,11],[148,16,148,17],[148,18,148,19],[148,20,148,21],[148,22,148,23],[148,24,148,25],[148,26,148,27],[148,28,148,29],[148,30,148,41],[149,0,149,2],[149,4,149,11],[149,16,149,17],[149,18,149,19],[149,20,149,21],[149,22,149,23],[149,24,149,25],[149,26,149,27],[149,28,149,29],[149,30,149,41],[150,0,150,2],[150,4,150,11],[150,16,150,17],[150,18,150,19],[150,20,150,21],[150,22,150,23],[150,24,150,25],[150,26,150,27],[150,28,150,29],[150,30,150,41],[151,0,151,2],[151,4,151,11],[151,16,151,17],[151,18,151,19],[151,20,151,21],[151,22,151,23],[151,24,151,25],[151,26,151,27],[151,28,151,29],[151,30,151,41],[152,0,152,2],[152,4,152,11],[152,16,152,17],[152,18,152,19],[152,20,152,21],[152,22,152,23],[152,24,152,25],[152,26,152,27],[152,28,152,29],[152,30,152,41],[153,0,153,2],[153,4,153,11],[153,16,153,17],[153,18,153,19],[153,20,153,21],[153,22,153,23],[153,24,153,25],[153,26,153,27],[153,28,153,29],[153,30,153,41],[154,0,154,2],[154,3,154,11],[154,12,164,13],[154,14,164,15],[154,16,154,17],[154,18,154,19],[154,20,154,21],[154,22,154,23],[154,24,154,25],[154,26,154,27],[154,28,154,29],[154,30,154,41],[155,0,155,2],[155,4,155,11],[155,16,155,17],[155,18,155,19],[155,20,155,21],[155,22,155,23],[155,24,155,25],[155,26,155,27],[155,28,155,29],[155,30,155,41],[156,0,156,2],[156,4,156,11],[156,16,156,17],[156,18,156,19],[156,20,156,21],[156,22,156,23],[156,24,156,25],[156,26,156,27],[156,28,156,29],[156,30,156,41],[157,0,157,2],[157,4,157,11],[157,16,157,17],[157,18,157,19],[157,20,157,21],[157,22,157,23],[157,24,157,25],[157,26,157,27],[157,28,157,29],[157,30,157,41],[158,0,158,2],[158,4,158,11],[158,16,158,17],[158,18,158,19],[158,20,158,21],[158,22,158,23],[158,24,158,25],[158,26,158,27],[158,28,158,29],[158,30,158,41],[159,0,159,2],[159,4,159,11],[159,16,159,17],[159,18,159,19],[159,20,159,21],[159,22,159,23],[159,24,159,25],[159,26,159,27],[159,28,159,29],[159,30,159,41],[160,0,160,2],[160,4,160,11],[160,16,160,17],[160,18,160,19],[160,20,160,21],[160,22,160,23],[160,24,160,25],[160,26,160,27],[160,28,160,29],[160,30,160,41],[161,0,161,2],[161,4,161,11],[161,16,161,17],[161,18,161,19],[161,20,161,21],[161,22,161,23],[161,24,161,25],[161,26,161,27],[161,28,161,29],[161,30,161,41],[162,0,162,2],[162,4,162,11],[162,16,162,17],[162,18,162,19],[162,20,162,21],[162,22,162,23],[162,24,162,25],[162,26,162,27],[162,28,162,29],[162,30,162,41],[163,0,163,2],[163,4,163,11],[163,16,163,17],[163,18,163,19],[163,20,163,21],[163,22,163,23],[163,24,163,25],[163,26,163,27],[163,28,163,29],[163,30,163,41],[164,0,164,2],[164,4,164,11],[164,16,164,17],[164,18,164,19],[164,20,164,21],[164,22,164,23],[164,24,164,25],[164,26,164,27],[164,28,164,29],[164,30,164,41],[165,0,165,2],[165,3,165,11],[165,12,165,13],[165,14,165,15],[165,16,165,17],[165,18,165,19],[165,20,165,21],[165,22,165,23],[165,24,165,25],[165,26,165,27],[165,28,165,29],[165,30,165,41],[166,0,166,2],[166,3,166,11],[166,12,166,13],[166,14,166,15],[166,16,166,17],[166,18,166,19],[166,20,166,21],[166,22,166,23],[166,24,166,25],[166,26,166,27],[166,28,166,29],[166,30,166,41],[167,0,167,2],[167,3,167,11],[167,12,167,13],[167,14,167,15],[167,16,167,17],[167,18,167,19],[167,20,167,21],[167,22,167,23],[167,24,167,25],[167,26,167,27],[167,28,167,29],[167,30,167,41],[168,0,168,2],[168,3,168,11],[168,12,168,13],[168,14,168,15],[168,16,168,17],[168,18,168,19],[168,20,168,21],[168,22,168,23],[168,24,168,25],[168,26,168,27],[168,28,168,29],[168,30,168,41],[169,0,169,2],[169,3,169,11],[169,12,169,13],[169,14,169,15],[169,16,169,17],[169,18,169,19],[169,20,169,21],[169,22,169,23],[169,24,169,25],[169,26,169,27],[169,28,169,29],[169,30,169,41],[170,0,170,2],[170,3,170,11],[170,12,172,13],[170,14,172,15],[170,16,170,17],[170,18,170,19],[170,20,170,21],[170,22,170,23],[170,24,170,25],[170,26,170,27],[170,28,170,29],[170,30,170,41],[171,0,171,2],[171,4,171,11],[171,16,171,17],[171,18,171,19],[171,20,171,21],[171,22,171,23],[171,24,171,25],[171,26,171,27],[171,28,171,29],[171,30,171,41],[172,0,172,2],[172,4,172,11],[172,16,172,17],[172,18,172,19],[172,20,172,21],[172,22,172,23],[172,24,172,25],[172,26,172,27],[172,28,172,29],[172,30,172,41],[173,0,173,2],[173,3,173,11],[173,12,173,13],[173,14,173,15],[173,16,173,17],[173,18,173,19],[173,20,173,21],[173,22,173,23],[173,24,173,25],[173,26,173,27],[173,28,173,29],[173,30,173,41],[174,0,174,2],[174,3,174,11],[174,12,174,13],[174,14,174,15],[174,16,174,17],[174,18,174,19],[174,20,174,21],[174,22,174,23],[174,24,174,25],[174,26,174,27],[174,28,174,29],[174,30,174,41],[175,0,175,2],[175,3,175,11],[175,12,175,13],[175,14,175,15],[175,16,175,17],[175,18,175,19],[175,20,175,21],[175,22,175,23],[175,24,175,25],[175,26,175,27],[175,28,175,29],[175,30,175,41],[176,0,176,2],[176,3,176,11],[176,12,176,13],[176,14,176,15],[176,16,176,17],[176,18,176,19],[176,20,176,21],[176,22,176,23],[176,24,176,25],[176,26,176,27],[176,28,176,29],[176,30,176,41],[178,0,178,2],[178,3,178,41],[179,0,179,2],[179,3,179,11],[179,12,179,13]],"merged_total":1763,"flags":["merged_cut"]}
[{"$f":"Sprachen!L388","v":"Abstimmung zum PPF-Verfahren "},{"$nulls":12},{"$f":"Sprachen!L304","v":"Sachnummer"},{"$nulls":6},{"$f":"IF('Deckblatt '!H20<>\"\",'Deckblatt '!H20,\"\")","v":""},{"$nulls":6},{"$f":"Sprachen!L361","v":"Version/ Datum"},{"$nulls":9},{"$f":"IF('Deckblatt '!H23<>\"\",'Deckblatt '!H23,\"\")","v":""},{"$nulls":7},"Hardwarebemusterung erforderlich",{"$f":"IF(S135=Sprachen!L4,\"X\",\"N\")","v":"N"},{"$nulls":5},"Sprachauswahl"]
[{"$nulls":13},{"$f":"Sprachen!L255","v":"Organisation"},{"$nulls":6},{"$f":"IF('Deckblatt '!U2=\"\",\"\",'Deckblatt '!U2)","v":""},{"$nulls":23},{"$f":"MATCH(BA2,Sprachen!A2:J2,0)","v":1},"Softwarebemusterung erforderlich",{"$f":"IF(S198=Sprachen!L4,\"X\",\"N\")","v":"N"},{"$nulls":5},{"$f":"'Deckblatt '!AP2","v":"Deutsch"}]
[{"$f":"Sprachen!L184","v":"Kontaktinformationen"}]
[{"$f":"Sprachen!L46","v":"Angaben zur Organisation"},{"$nulls":19},{"$f":"Sprachen!L45","v":"Angaben zum Kunden"}]
[{"$f":"Sprachen!L235","v":"Name der Organisation"},{"$nulls":6},{"$f":"IF('Deckblatt '!A4<>\"\",'Deckblatt '!A4,\"\")","v":""},{"$nulls":12},{"$f":"Sprachen!L236","v":"Name des Kunden"},{"$nulls":6},{"$f":"IF('Deckblatt '!A10<>\"\",'Deckblatt '!A10,\"\")","v":""}]
[{"$f":"Sprachen!L276","v":"Produktionsstandort"},{"$nulls":6},{"$f":"IF('Deckblatt '!H19<>\"\",'Deckblatt '!H19,\"\")","v":""},{"$nulls":12},{"$f":"Sprachen!L121","v":"Empfängerstandort"}]
[{"$f":"Sprachen!L10","v":"Adresse"},{"$nulls":6},{"$f":"IF('Deckblatt '!A5<>\"\",'Deckblatt '!A5,\"\")","v":""},{"$nulls":12},{"$f":"Sprachen!L10","v":"Adresse"},{"$nulls":6},{"$f":"IF('Deckblatt '!A11<>\"\",'Deckblatt '!A11,\"\")","v":""}]
[{"$f":"Sprachen!L199","v":"Lieferstandort"},{"$nulls":6},{"$f":"IF('Deckblatt '!H18<>\"\",'Deckblatt '!H18,\"\")","v":""},{"$nulls":12},{"$f":"Sprachen!L14","v":"Abladestelle"},{"$nulls":6},{"$f":"IF('Deckblatt '!AI19<>\"\",'Deckblatt '!AI19,\"\")","v":""}]
[{"$f":"Sprachen!L10","v":"Adresse"},{"$nulls":19},{"$f":"Sprachen!L10","v":"Adresse"}]
[{"$f":"Sprachen!L196","v":"Lieferantennummer/ \nDUNS-Code"},{"$nulls":6},{"$f":"IF('Deckblatt '!V23<>\"\",'Deckblatt '!V23,\"\")","v":""},{"$nulls":12},{"$f":"Sprachen!L87","v":"Bestellnr. PPF-Muster"},{"$nulls":6},{"$f":"IF('Deckblatt '!AI18<>\"\",'Deckblatt '!AI18,\"\")","v":""}]
[{"$f":"Sprachen!L75","v":"Berichtsnummer"},{"$nulls":6},{"$f":"IF('Deckblatt '!H16<>\"\",'Deckblatt '!H16,\"\")","v":""},{"$nulls":12},{"$f":"Sprachen!L75","v":"Berichtsnummer"},{"$nulls":6},{"$f":"IF('Deckblatt '!S37<>\"\",'Deckblatt '!S37,\"\")","v":""}]
[{"$f":"Sprachen!L77","v":"Berichtsversion"},{"$nulls":6},{"$f":"IF('Deckblatt '!H17<>\"\",'Deckblatt '!H17,\"\")","v":""},{"$nulls":12},{"$f":"Sprachen!L77","v":"Berichtsversion"}]
[{"$f":"Sprachen!L47","v":"Ansprechpartner"}]
[null,null,{"$f":"Sprachen!L187","v":"Kunde"},{"$nulls":4},{"$f":"Sprachen!L234","v":"Name"},{"$nulls":12},{"$f":"Sprachen!L343","v":"Telefon"},{"$nulls":6},{"$f":"Sprachen!L204","v":"E-Mail"}]
[null,null,{"$f":"Sprachen!L296","v":"Qualitäts-management"}]
[null,null,{"$f":"Sprachen!L114","v":"Einkauf (optional)"}]
[null,null,{"$f":"Sprachen!L281","v":"Projektleiter (optional)"}]
[null,null,{"$f":"Sprachen!L127","v":"Entwicklung (optional)"}]
[null,null,{"$f":"Sprachen!L134","v":"Fertigung (optional)"}]
[null,null,{"$f":"Sprachen!L212","v":"Messtechnik (optional)"}]
[null,null,{"$f":"Sprachen!L369","v":"Werkstofftechnik (optional)"}]
[null,null,{"$f":"Sprachen!L254","v":"Organisation"},{"$nulls":4},{"$f":"Sprachen!L234","v":"Name"},{"$nulls":12},{"$f":"Sprachen!L343","v":"Telefon"},{"$nulls":6},{"$f":"Sprachen!L204","v":"E-Mail"}]
[null,null,{"$f":"Sprachen!L296","v":"Qualitäts-management"}]
[null,null,{"$f":"Sprachen!L64","v":"PPF-Verantwortlicher (optional)"}]
[null,null,{"$f":"Sprachen!L281","v":"Projektleiter (optional)"}]
[null,null,{"$f":"Sprachen!L127","v":"Entwicklung (optional)"}]
[null,null,{"$f":"Sprachen!L134","v":"Fertigung (optional)"}]
[null,null,{"$f":"Sprachen!L212","v":"Messtechnik (optional)"}]
[null,null,{"$f":"Sprachen!L369","v":"Werkstofftechnik (optional)"}]
[{"$f":"Sprachen!L59","v":"Bauteilinformationen"}]
[{"$f":"Sprachen!L46","v":"Angaben zur Organisation"},{"$nulls":19},{"$f":"Sprachen!L45","v":"Angaben zum Kunden"}]
[{"$f":"Sprachen!L65","v":"Benennung"},{"$nulls":19},{"$f":"Sprachen!L65","v":"Benennung"}]
[{"$f":"Sprachen!L304","v":"Sachnummer"},{"$nulls":19},{"$f":"Sprachen!L304","v":"Sachnummer"}]
[{"$f":"Sprachen!L374","v":"Zeichnungsnummer"},{"$nulls":19},{"$f":"Sprachen!L374","v":"Zeichnungsnummer"}]
[{"$f":"Sprachen!L361","v":"Version/ Datum"},{"$nulls":19},{"$f":"Sprachen!L361","v":"Version/ Datum"}]
[{"$nulls":20},{"$f":"Sprachen!L189","v":"Kundenspezifische Teilestände\n(z. B. TGS/ F-Stand/ Q-Stand, …)"}]
[{"$f":"Sprachen!L80","v":"Besondere Merkmale (Sicherheit, Zulassung, Funktion)"},{"$nulls":19},{"$f":"Sprachen!L80","v":"Besondere Merkmale (Sicherheit, Zulassung, Funktion)"}]
["Bauteil mit besonderer Archivierungspflicht",{"$nulls":13},{"$f":"Sprachen!L470","v":"Besondere Archivierungspflicht"}]
[{"$f":"Sprachen!L340","v":"Teilebündelung/Produktfamilien"}]
[null,null,{"$f":"Sprachen!L267","v":"PPF-Verfahren für Produktfamilie"},{"$nulls":17},{"$f":"Sprachen!L158","v":"ggf. Anhang für Auflistung aller betroffenen Sachnrn. verwenden"}]
[null,null,{"$f":"Sprachen!L65","v":"Benennung"},{"$nulls":8},{"$f":"Sprachen!L304","v":"Sachnummer"},{"$nulls":4},{"$f":"Sprachen!L361","v":"Version/ Datum"},{"$nulls":3},{"$f":"Sprachen!L66","v":"Benennung Kunde"},{"$nulls":12},{"$f":"Sprachen!L304","v":"Sachnummer"},{"$nulls":4},{"$f":"Sprachen!L361","v":"Version/ Datum"}]
[{"$nulls":42},{"$f":"COUNTA(C42:AP42)","v":0}]
[{"$nulls":42},{"$f":"COUNTA(C43:AP43)","v":0}]
[{"$nulls":42},0]
[{"$nulls":42},0]
[{"$nulls":42},0]
[{"$nulls":42},0]
[{"$nulls":42},0]
[{"$nulls":42},0]
[{"$f":"Sprachen!L351","v":"Varianten-PPF"}]
[null,null,{"$f":"Sprachen!L352","v":"Varianten-PPF zu bereits vorgelegtem PPF-Verfahren"}]
[null,null,{"$f":"Sprachen!L299","v":"Referenz-Berichtsnummer Organisation"},{"$nulls":8},{"$f":"Sprachen!L77","v":"Berichtsversion"},{"$nulls":4},{"$f":"Sprachen!L91","v":"Datum"},{"$nulls":3},{"$f":"Sprachen!L298","v":"Referenz-Berichtsnummer Kunden"},{"$nulls":12},{"$f":"Sprachen!L77","v":"Berichtsversion"},{"$nulls":4},{"$f":"Sprachen!L91","v":"Datum"}]
[{"$nulls":42},{"$f":"COUNTA(C53:AP53)","v":0}]
[{"$f":"Sprachen!L318","v":"Setzteile"}]
[null,null,{"$f":"Sprachen!L319","v":"Setzteile mit Q-Verantwortung der Organisation"},{"$nulls":17},{"$f":"Sprachen!L158","v":"ggf. Anhang für Auflistung aller betroffenen Sachnrn. verwenden"}]
[null,null,{"$f":"Sprachen!L67","v":"Benennung Organisation"},{"$nulls":8},{"$f":"Sprachen!L304","v":"Sachnummer"},{"$nulls":4},{"$f":"Sprachen!L361","v":"Version/ Datum"},{"$nulls":3},{"$f":"Sprachen!L66","v":"Benennung Kunde"},{"$nulls":12},{"$f":"Sprachen!L304","v":"Sachnummer"},{"$nulls":4},{"$f":"Sprachen!L361","v":"Version/ Datum"}]
[{"$nulls":42},{"$f":"COUNTA(C57:AP57)","v":0}]
[{"$nulls":42},{"$f":"COUNTA(C58:AP58)","v":0}]
[{"$nulls":42},0]
[{"$nulls":42},0]
[{"$nulls":42},0]
[{"$nulls":42},0]
[{"$nulls":42},0]
[null,null,{"$f":"Sprachen!L320","v":"Setzteile mit Q-Verantwortung des Kunden"},{"$nulls":17},{"$f":"Sprachen!L158","v":"ggf. Anhang für Auflistung aller betroffenen Sachnrn. verwenden"}]
[null,null,{"$f":"Sprachen!L67","v":"Benennung Organisation"},{"$nulls":8},{"$f":"Sprachen!L304","v":"Sachnummer"},{"$nulls":4},{"$f":"Sprachen!L361","v":"Version/ Datum"},{"$nulls":3},{"$f":"Sprachen!L66","v":"Benennung Kunde"},{"$nulls":12},{"$f":"Sprachen!L304","v":"Sachnummer"},{"$nulls":4},{"$f":"Sprachen!L361","v":"Version/ Datum"}]
[{"$nulls":42},{"$f":"COUNTA(C66:AP66)","v":0}]
[{"$nulls":42},0]
[{"$nulls":42},0]
[{"$nulls":42},0]
[{"$nulls":42},0]
[{"$nulls":42},0]
[{"$nulls":42},0]
[{"$f":"Sprachen!L159","v":"Grund der Berichterstellung"}]
[{"$f":"Sprachen!L159","v":"Grund der Berichterstellung"},{"$nulls":19},{"$f":"Sprachen!L55","v":"Auslöser PPF-Verfahren"}]
[null,null,{"$f":"Sprachen!L71","v":"Bericht Produktionsprozess- und Produktfreigabe (PPF)"},{"$nulls":20},{"$f":"Sprachen!L218","v":"Mustervorstellung"},{"$nulls":18},{"$f":"COUNTIF(A75:B77,\"X\")","v":0}]
[null,null,{"$f":"Sprachen!L72","v":"Bericht sonstige Muster"},{"$nulls":20},{"$f":"Sprachen!L239","v":"Neuteil"}]
[null,null,{"$f":"Sprachen!L301","v":"Requalifikation"},{"$nulls":20},{"$f":"Sprachen!L36","v":"Änderungen am Produkt"}]
[{"$f":"Sprachen!L345","v":"Übermittlung der PPF-Unterlagen"},{"$nulls":22},{"$f":"Sprachen!L37","v":"Änderungen am Produktionsprozess"},{"$nulls":18},{"$f":"COUNTIF(U75:V81,\"X\")","v":0}]
[null,null,{"$f":"Sprachen!L258","v":"PDF-Format"},{"$nulls":9},{"$f":"Sprachen!L256","v":"Original"},{"$nulls":10},{"$f":"Sprachen!L35","v":"Änderung in der Lieferkette"}]
[null,null,{"$f":"Sprachen!L262","v":"Portal"},{"$nulls":9},{"$f":"Sprachen!L257","v":"Papierform"},{"$nulls":10},{"$f":"Sprachen!L373","v":"Wiedernutzung > 12 Monate Stillstand"}]
[null,null,{"$f":"Sprachen!L327","v":"Sonstiges"},{"$nulls":20},{"$f":"Sprachen!L24","v":"Aktualisierte PPF-Dokumentation"},{"$nulls":18},{"$f":"COUNTIF(A79:B81,\"X\")+COUNTIF(K79:L80,\"X\")","v":0}]
[{"$f":"Sprachen!L346","v":"Übermittlungssprache des PPF-Verfahrens"}]
[]
[{"$f":"Sprachen!L156","v":"Gestuftes PPF-Verfahren"}]
[null,null,{"$f":"Sprachen!L157","v":"gestuftes PPF-Verfahren (Bitte unten vereinbaren, die Termine der einzelnen PPF-Stufen angeben und die notwendigen Dokumente je Vorgang planen)"}]
[null,null,{"$f":"Sprachen!L60","v":"Begründung des gestuften PPF-Verfahrens"}]
[]
[]
[]
[]
[]
[null,null,{"$f":"Sprachen!L86","v":"Bestätigung Organisation:"}]
[null,null,{"$f":"Sprachen!L99","v":"Die vorgestellten Muster wurden bezüglich der nachzuweisenden Merkmale mit serienmäßigen Betriebsmitteln unter serienmäßigen"}]
[null,null,{"$f":"Sprachen!L100","v":"Bedingungen am Serienstandort hergestellt bzw. bei „sonstigen Mustern“ gemäß Vereinbarung zwischen Organisation und Kunde"}]
[null,null,{"$f":"Sprachen!L101","v":"(als Anlage beigefügt). Bezüglich dieser Merkmale sind keine Änderungen bekannt bzw. geplant. Die bei unseren Prüfungen und"}]
[null,null,{"$f":"Sprachen!L102","v":"der Freigabe erzielten Ergebnisse können für eine aktualisierte PPF-Dokumentation übernommen werden.  Sollten trotzdem Änderungen an"}]
[null,null,{"$f":"Sprachen!L103","v":"Teil und/oder Produktionsprozess notwendig sein, werden wir dies bei der aktualisierten PPF-Dokumentation anzeigen."}]
[{"$f":"Sprachen!L344","v":"Terminabstimmung"}]
[{"$f":"Sprachen!L266","v":"PPF-Termin"},{"$nulls":13},{"$f":"Sprachen!L156","v":"Gestuftes PPF-Verfahren"}]
[{"$f":"Sprachen!L58","v":"PPF-Verfahren"},{"$nulls":13},{"$f":"Sprachen!L306","v":"Stufe 1"},{"$nulls":12},{"$f":"Sprachen!L308","v":"Stufe 3"}]
[{"$f":"Sprachen!L349","v":"Varianten"},{"$nulls":13},{"$f":"Sprachen!L307","v":"Stufe 2"},{"$nulls":12},{"$f":"Sprachen!L309","v":"Stufe 4"}]
[{"$nulls":14},{"$f":"Sprachen!L123","v":"Endtermin des PPF-Verfahrens"}]
[{"$f":"Sprachen!L168","v":"IMDS-ID Kunde"},{"$nulls":13},{"$f":"Sprachen!L68","v":"Bereitstellung IMDS"}]
[null,null,{"$f":"Sprachen!L96","v":"Der Kunde verzichtet auf die Vorlage von Dokumenten. \nDurchführung und Dokumentation des PPF-Verfahrens erfolgen ausschließlich innerhalb der Organisation.\nDer Kunde schließt sich der Freigabeempfehlung der Organisation an."}]
[null,null,{"$f":"Sprachen!L91","v":"Datum"},{"$nulls":18},{"$f":"Sprachen!L348","v":"Unterschrift"}]
[{"$nulls":3},{"$f":"Sprachen!L215","v":"Mitgeltende Unterlagen zum PPF-Verfahren"}]
[{"$f":"Sprachen!L49","v":"Anwendung"},null,null,{"$f":"Sprachen!L347","v":"Unterlagen"},{"$nulls":8},{"$f":"Sprachen!L112","v":"Dokumenten-nummer"},{"$nulls":4},{"$f":"Sprachen!L54","v":"Ausgabe/ Stand/Datum"},{"$nulls":4},{"$f":"Sprachen!L62","v":"Bemerkung/Beschreibung"}]
[{"$nulls":3},{"$f":"Sprachen!L332","v":"Technische Kundenunterlagen"}]
[{"$nulls":3},{"$f":"Sprachen!L375","v":"Zonenfestlegung für optische Beurteilung"}]
[{"$nulls":3},{"$f":"Sprachen!L139","v":"Festlegung Grenzmuster"}]
[{"$nulls":3},{"$f":"Sprachen!L140","v":"Festlegung Porenklassen"}]
[{"$nulls":3},{"$f":"Sprachen!L15","v":"Abnahmerichtlinien"}]
[{"$nulls":3},{"$f":"Sprachen!L294","v":"Prüfvorschriften"}]
[{"$nulls":3},{"$f":"Sprachen!L247","v":"Normen"}]
[{"$nulls":3},{"$f":"Sprachen!L201","v":"Liste mit Terminen für \nFarb-/Varianten-PPF"}]
{"$rows_empty":10}
[{"$f":"Sprachen!L349","v":"Varianten"}]
[{"$f":"Sprachen!L49","v":"Anwendung"},null,null,{"$f":"Sprachen!L169","v":"Inhalte"},{"$nulls":8},{"$f":"Sprachen!L79","v":"Beschreibung"},{"$nulls":14},{"$f":"Sprachen!L78","v":"Berücksichtigung im Rahmen des PPF-Verfahrens"}]
[{"$nulls":3},{"$f":"Sprachen!L322","v":"Sind Ausweichmaschinen oder -prozesse geplant?"}]
[{"$nulls":3},{"$f":"Sprachen!L321","v":"Sind Alternativlieferanten vorgesehen?"}]
[{"$f":"Sprachen!L19","v":"Abstimmung PPF-Inhalt und Vorlage"}]
[{"$f":"Sprachen!L253","v":"Ordnungs-    nummer"},null,null,{"$f":"Sprachen!L289","v":"Prüfgebiet"},null,null,{"$f":"Sprachen!L12","v":"(sofern für das Produkt zutreffend)"},{"$nulls":5},{"$f":"Sprachen!L40","v":"Anforderung vorhanden"},null,{"$f":"Sprachen!L366","v":"Vorlage erforderlich"},null,{"$f":"Sprachen!L57","v":"PPF-Verfahren"},null,{"$f":"Sprachen!L351","v":"Varianten-PPF"},null,{"$f":"Sprachen!L310","v":"Schritt bei gestuftem PPF-Verfahren"},{"$nulls":7},{"$f":"Sprachen!A381","v":"Bestandteil Requalifikation"},null,{"$f":"Sprachen!L61","v":"Bemerkung"}]
[{"$nulls":20},{"$f":"Sprachen!L306","v":"Stufe 1"},null,{"$f":"Sprachen!L307","v":"Stufe 2"},null,{"$f":"Sprachen!L308","v":"Stufe 3"},null,{"$f":"Sprachen!L309","v":"Stufe 4"},{"$nulls":15},"Anforderung vorhanden","Auswahl erfolgt","Vorlage erforderlich"]
["0.1",null,null,{"$f":"Sprachen!L94","v":"PPF-Deckblatt/PPF-Bewertung"},{"$nulls":8},{"$f":"Sprachen!L4","v":"Ja"},null,{"$f":"Sprachen!L4","v":"Ja"},null,"X",null,"X",null,"X",null,"X",null,"X",null,"X",null,{"$f":"Sprachen!L4","v":"Ja"},{"$nulls":13},{"$f":"M133=Sprachen!$L$4","v":true},"=",{"$f":"O133=Sprachen!$L$4","v":true}]
["0.2",null,null,{"$f":"Sprachen!L313","v":"Selbstbeurteilung Produkt, Produktionsprozess und ggf. Software"},{"$nulls":8},{"$f":"Sprachen!L4","v":"Ja"},null,{"$f":"Sprachen!L4","v":"Ja"},{"$nulls":27},{"$f":"M134=Sprachen!$L$4","v":true},{"$f":"COUNTIF(Q134:T134,\"X\")","v":0},{"$f":"O134=Sprachen!$L$4","v":true}]
[{"$f":"Sprachen!L165","v":"Hardwarefreigabe erforderlich"}]
["1. ",null,null,{"$f":"Sprachen!L228","v":"Nachweise zur Produktentwicklung"}]
["1.1",null,null,{"$f":"Sprachen!L334","v":"Technische Spezifikationen "},{"$nulls":38},{"$f":"M137=Sprachen!$L$4","v":false},{"$f":"COUNTIF(Q137:T137,\"X\")","v":0},{"$f":"O137=Sprachen!$L$4","v":false}]
["1.2",null,null,{"$f":"Sprachen!L150","v":"Genehmigte Konstruktionsänderungen"},{"$nulls":38},{"$f":"M138=Sprachen!$L$4","v":false},{"$f":"COUNTIF(Q138:T138,\"X\")","v":0},{"$f":"O138=Sprachen!$L$4","v":false}]
["1.3",null,null,{"$f":"Sprachen!L183","v":"Konstruktions-, Entwicklungsfreigaben der Organisation bei Entwicklungsverantwortung entsprechend Vereinbarung"},{"$nulls":38},{"$f":"M139=Sprachen!$L$4","v":false},{"$f":"COUNTIF(Q139:T139,\"X\")","v":0},{"$f":"O139=Sprachen!$L$4","v":false}]
["1.4",null,null,{"$f":"Sprachen!L209","v":"Materialdaten per IMDS"},{"$nulls":8},{"$f":"IF(OR(AU1=\"X\",AU2=\"X\"),Sprachen!L4,\"\")","v":""},null,{"$f":"IF(OR(AU1=\"X\",AU2=\"X\"),Sprachen!L4,\"\")","v":""},{"$nulls":27},{"$f":"M140=Sprachen!$L$4","v":false},{"$f":"COUNTIF(Q140:T140,\"X\")","v":0},{"$f":"O140=Sprachen!$L$4","v":false}]
["1.5",null,null,{"$f":"Sprachen!L97","v":"Design-FMEA"},{"$nulls":38},{"$f":"M141=Sprachen!$L$4","v":false},{"$f":"COUNTIF(Q141:AB141,\"X\")","v":0},{"$f":"O141=Sprachen!$L$4","v":false}]
["2. ",null,null,{"$f":"Sprachen!L229","v":"Nachweise zur Produktionsprozessentwicklung"}]
["2.1",null,null,{"$f":"Sprachen!L283","v":"Prozessablaufdiagramm"},{"$nulls":38},{"$f":"M143=Sprachen!$L$4","v":false},{"$f":"COUNTIF(Q143:T143,\"X\")","v":0},{"$f":"O143=Sprachen!$L$4","v":false}]
["2.2",null,null,{"$f":"Sprachen!L287","v":"Prozess-FMEA"},{"$nulls":38},{"$f":"M144=Sprachen!$L$4","v":false},{"$f":"COUNTIF(Q144:AB144,\"X\")","v":0},{"$f":"O144=Sprachen!$L$4","v":false}]
["2.3",null,null,{"$f":"Sprachen!L275","v":"Produktionslenkungsplan"},{"$nulls":38},{"$f":"M145=Sprachen!$L$4","v":false},{"$f":"COUNTIF(Q145:AB145,\"X\")","v":0},{"$f":"O145=Sprachen!$L$4","v":false}]
["3. ",null,null,{"$f":"Sprachen!L231","v":"Nachweise zur Validierung des Produktes"}]
["3.1",null,null,{"$f":"Sprachen!L153","v":"Geometrie, Maß"},{"$nulls":12},{"$f":"Sprachen!L52","v":"Anzahl Teile pro Nest/Form"},{"$nulls":25},{"$f":"M147=Sprachen!$L$4","v":false},{"$f":"COUNTIF(Q147:AB147,\"X\")","v":0},{"$f":"O147=Sprachen!$L$4","v":false}]
["3.1.1",{"$nulls":3},{"$f":"Sprachen!L303","v":"Rohteilmessung"},{"$nulls":37},{"$f":"M148=Sprachen!$L$4","v":false},{"$f":"COUNTIF(Q148:T148,\"X\")","v":0},{"$f":"O148=Sprachen!$L$4","v":false}]
["3.1.2",{"$nulls":3},{"$f":"Sprachen!L116","v":"Einzelteilmessung"},{"$nulls":37},{"$f":"M149=Sprachen!$L$4","v":false},{"$f":"COUNTIF(Q149:T149,\"X\")","v":0},{"$f":"O149=Sprachen!$L$4","v":false}]
["3.1.3",{"$nulls":3},{"$f":"Sprachen!L330","v":"Standardmessbericht (alle Zeichnungsmerkmale)"},{"$nulls":37},{"$f":"M150=Sprachen!$L$4","v":false},0,{"$f":"O150=Sprachen!$L$4","v":false}]
["3.1.4",{"$nulls":3},{"$f":"Sprachen!L329","v":"Standardlehrenbericht"},{"$nulls":37},{"$f":"M151=Sprachen!$L$4","v":false},0,{"$f":"O151=Sprachen!$L$4","v":false}]
["3.1.5",{"$nulls":3},{"$f":"Sprachen!L13","v":"3D-Datensatzmessung"},{"$nulls":37},{"$f":"M152=Sprachen!$L$4","v":false},0,{"$f":"O152=Sprachen!$L$4","v":false}]
["3.1.6",{"$nulls":3},{"$f":"Sprachen!L305","v":"Schnitte"},{"$nulls":37},{"$f":"M153=Sprachen!$L$4","v":false},0,{"$f":"O153=Sprachen!$L$4","v":false}]
["3.1.7",{"$nulls":3},{"$f":"Sprachen!L327","v":"Sonstiges"},{"$nulls":37},{"$f":"M154=Sprachen!$L$4","v":false},0,{"$f":"O154=Sprachen!$L$4","v":false}]
["3.2",null,null,{"$f":"Sprachen!L368","v":"Werkstoff (Festigkeit, physikalische Eigenschaften, …)"},{"$nulls":38},{"$f":"M155=Sprachen!$L$4","v":false},0,{"$f":"O155=Sprachen!$L$4","v":false}]
["3.2.1",{"$nulls":3},{"$f":"Sprachen!L222","v":"Nachweis Einhaltung werkstoffspezifischer Kundennormen"},{"$nulls":37},{"$f":"M156=Sprachen!$L$4","v":false},0,{"$f":"O156=Sprachen!$L$4","v":false}]
["3.2.2",{"$nulls":3},{"$f":"Sprachen!L269","v":"Probeentnahmeplan"},{"$nulls":37},{"$f":"M157=Sprachen!$L$4","v":false},0,{"$f":"O157=Sprachen!$L$4","v":false}]
["3.2.3",{"$nulls":3},{"$f":"Sprachen!L213","v":"Metallographie"},{"$nulls":37},{"$f":"M158=Sprachen!$L$4","v":false},0,{"$f":"O158=Sprachen!$L$4","v":false}]
["3.2.4",{"$nulls":3},{"$f":"Sprachen!L90","v":"Chemische Analysen"},{"$nulls":37},{"$f":"M159=Sprachen!$L$4","v":false},0,{"$f":"O159=Sprachen!$L$4","v":false}]
["3.2.5",{"$nulls":3},{"$f":"Sprachen!L141","v":"Freigabe Einzelteile"},{"$nulls":37},{"$f":"M160=Sprachen!$L$4","v":false},0,{"$f":"O160=Sprachen!$L$4","v":false}]
["3.2.6",{"$nulls":3},{"$f":"Sprachen!L142","v":"Freigabe Hilfs- und Betriebsstoffe"},{"$nulls":37},{"$f":"M161=Sprachen!$L$4","v":false},0,{"$f":"O161=Sprachen!$L$4","v":false}]
["3.2.7",{"$nulls":3},{"$f":"Sprachen!L210","v":"Mechanische Kennwerte"},{"$nulls":37},{"$f":"M162=Sprachen!$L$4","v":false},0,{"$f":"O162=Sprachen!$L$4","v":false}]
["3.2.8",{"$nulls":3},{"$f":"Sprachen!L143","v":"Freigabe Rohteile"},{"$nulls":37},{"$f":"M163=Sprachen!$L$4","v":false},0,{"$f":"O163=Sprachen!$L$4","v":false}]
["3.2.9",{"$nulls":3},{"$f":"Sprachen!L186","v":"Korrosionsprüfung"},{"$nulls":37},{"$f":"M164=Sprachen!$L$4","v":false},0,{"$f":"O164=Sprachen!$L$4","v":false}]
["3.2.10",{"$nulls":3},{"$f":"Sprachen!L327","v":"Sonstiges"},{"$nulls":37},{"$f":"M165=Sprachen!$L$4","v":false},0,{"$f":"O165=Sprachen!$L$4","v":false}]
["3.3",null,null,{"$f":"Sprachen!L148","v":"Funktionsprüfung gemäß KLH/Spezifikation/Funktions-vorschriften"},{"$nulls":38},{"$f":"M166=Sprachen!$L$4","v":false},0,{"$f":"O166=Sprachen!$L$4","v":false}]
["3.4",null,null,{"$f":"Sprachen!L162","v":"Haptikprüfung"},{"$nulls":38},{"$f":"M167=Sprachen!$L$4","v":false},0,{"$f":"O167=Sprachen!$L$4","v":false}]
["3.5",null,null,{"$f":"Sprachen!L28","v":"Akustikprüfung"},{"$nulls":38},{"$f":"M168=Sprachen!$L$4","v":false},0,{"$f":"O168=Sprachen!$L$4","v":false}]
["3.6",null,null,{"$f":"Sprachen!L155","v":"Geruchsprüfung"},{"$nulls":38},{"$f":"M169=Sprachen!$L$4","v":false},0,{"$f":"O169=Sprachen!$L$4","v":false}]
["3.7",null,null,{"$f":"Sprachen!L56","v":"Aussehen"},{"$nulls":38},{"$f":"M170=Sprachen!$L$4","v":false},0,{"$f":"O170=Sprachen!$L$4","v":false}]
["3.8",null,null,{"$f":"Sprachen!L252","v":"Oberflächenanforderung"},{"$nulls":38},{"$f":"M171=Sprachen!$L$4","v":false},0,{"$f":"O171=Sprachen!$L$4","v":false}]
["3.8.1",{"$nulls":3},{"$f":"Sprachen!L132","v":"Farbmessung und visuelle Eigenbeurteilung"},{"$nulls":37},{"$f":"M171=Sprachen!$L$4","v":false},0,{"$f":"O172=Sprachen!$L$4","v":false}]
["3.8.2",{"$nulls":3},{"$f":"Sprachen!L131","v":"Farbabhängige Eigenschaften"},{"$nulls":37},{"$f":"M171=Sprachen!$L$4","v":false},0,{"$f":"O173=Sprachen!$L$4","v":false}]
["3.9",null,null,{"$f":"Sprachen!L333","v":"Technische Sauberkeit"},{"$nulls":38},{"$f":"M174=Sprachen!$L$4","v":false},0,{"$f":"O174=Sprachen!$L$4","v":false}]
["3.10",null,null,{"$f":"Sprachen!L377","v":"Zuverlässigkeit"},{"$nulls":38},{"$f":"M175=Sprachen!$L$4","v":false},0,{"$f":"O175=Sprachen!$L$4","v":false}]
["3.11",null,null,{"$f":"Sprachen!L82","v":"Beständigkeit gegenüber Electrostatic Discharge (ESD) "},{"$nulls":38},{"$f":"M176=Sprachen!$L$4","v":false},0,{"$f":"O176=Sprachen!$L$4","v":false}]
["3.12",null,null,{"$f":"Sprachen!L117","v":"Elektrische Sicherheit / Hochvolt-Sicherheit"},{"$nulls":38},{"$f":"M177=Sprachen!$L$4","v":false},0,{"$f":"O177=Sprachen!$L$4","v":false}]
["3.13",null,null,{"$f":"Sprachen!L118","v":"Elektromagnetische Verträglichkeit (EMV)"},{"$nulls":38},{"$f":"M178=Sprachen!$L$4","v":false},0,{"$f":"O178=Sprachen!$L$4","v":false}]
["4. ",null,null,{"$f":"Sprachen!L232","v":"Nachweise zur Validierung des Produktionsprozesses"}]
["4.1",null,null,{"$f":"Sprachen!L16","v":"Absicherung Besonderer Merkmale gemäß technischen Spezifikationen und vereinbarten Merkmalen (z. B. Poka Yoke, 100%-Prüfung, Prozessfähigkeiten, …)"},{"$nulls":38},{"$f":"M180=Sprachen!$L$4","v":false},{"$f":"COUNTIF(Q180:T180,\"X\")","v":0},{"$f":"O180=Sprachen!$L$4","v":false}]
["4.2",null,null,{"$f":"Sprachen!L194","v":"Laborqualifizierung"},{"$nulls":38},{"$f":"M181=Sprachen!$L$4","v":false},0,{"$f":"O181=Sprachen!$L$4","v":false}]
["4.3",null,null,{"$f":"Sprachen!L216","v":"Muster inkl. Fertigungsdokumentation"},{"$nulls":38},{"$f":"M182=Sprachen!$L$4","v":false},0,{"$f":"O182=Sprachen!$L$4","v":false}]
["4.4",null,null,{"$f":"Sprachen!L300","v":"Referenzmuster"},{"$nulls":38},{"$f":"M183=Sprachen!$L$4","v":false},0,{"$f":"O183=Sprachen!$L$4","v":false}]
["4.5",null,null,{"$f":"Sprachen!L274","v":"Produktionskapazität"},{"$nulls":38},{"$f":"M184=Sprachen!$L$4","v":false},0,{"$f":"O184=Sprachen!$L$4","v":false}]
["4.6",null,null,{"$f":"Sprachen!L372","v":"Werkzeuge (mit Stückzahl/Anzahl Nester und Information zum Werkzeugkonzept)"},{"$nulls":38},{"$f":"M185=Sprachen!$L$4","v":false},0,{"$f":"O185=Sprachen!$L$4","v":false}]
["5. ",null,null,{"$f":"Sprachen!L152","v":"Generelle Nachweise"}]
["5.1",null,null,{"$f":"Sprachen!L226","v":"Nachweise zur Einhaltung gesetzlicher Anforderungen "},{"$nulls":8},{"$f":"IF(OR(AU1=\"X\",AU2=\"X\"),Sprachen!L4,\"\")","v":""},null,{"$f":"IF(M187=Sprachen!L4,Sprachen!L4,\"\")","v":""},{"$nulls":27},{"$f":"M187=Sprachen!$L$4","v":false},{"$f":"COUNTIF(Q187:T187,\"X\")","v":0},{"$f":"O187=Sprachen!$L$4","v":false}]
["5.2",null,null,{"$f":"Sprachen!L264","v":"PPF-Status Lieferkette"},{"$nulls":38},{"$f":"M188=Sprachen!$L$4","v":false},{"$f":"COUNTIF(Q188:T188,\"X\")","v":0},{"$f":"O188=Sprachen!$L$4","v":false}]
["5.3",null,null,{"$f":"Sprachen!L292","v":"Prüfmittelliste Produkt und Produktionsprozess"},{"$nulls":38},{"$f":"M189=Sprachen!$L$4","v":false},0,{"$f":"O189=Sprachen!$L$4","v":false}]
[{"$nulls":4},{"$f":"Sprachen!L288","v":"Prüf-/Messprotokolle bzw. Abnahmeprotokolle für Lehren"},{"$nulls":37},{"$f":"M190=Sprachen!$L$4","v":false},0,{"$f":"O190=Sprachen!$L$4","v":false}]
["5.4",null,null,{"$f":"Sprachen!L291","v":"Prüfmittelfähigkeitsnachweis Produkt u. Produktionsprozess"},{"$nulls":38},{"$f":"M191=Sprachen!$L$4","v":false},0,{"$f":"O191=Sprachen!$L$4","v":false}]
["5.5",null,null,{"$f":"Sprachen!L341","v":"Teilelebenslauf"},{"$nulls":8},{"$f":"IF(AU1=\"X\",Sprachen!L4,\"\")","v":""},null,{"$f":"IF(M192=Sprachen!L4,Sprachen!L4,\"\")","v":""},{"$nulls":27},{"$f":"M192=Sprachen!$L$4","v":false},0,{"$f":"O192=Sprachen!$L$4","v":false}]
["5.6",null,null,{"$f":"Sprachen!L113","v":"Eignungsnachweis der eingesetzten Ladungsträger inkl. Lagerung"},{"$nulls":38},{"$f":"M193=Sprachen!$L$4","v":false},0,{"$f":"O193=Sprachen!$L$4","v":false}]
["5.7",null,null,{"$f":"Sprachen!L107","v":"Dokumentation der Vereinbarungen zum Befundungs- und Analyseprozess\n- Reklamationsbearbeitung (z.B. 8D)\n- Schadteilanalyse Feld"},{"$nulls":38},{"$f":"M194=Sprachen!$L$4","v":false},0,{"$f":"O194=Sprachen!$L$4","v":false}]
["5.8",null,null,{"$f":"Sprachen!L106","v":"Dokumentation der Vereinbarung zur Requalifikation"},{"$nulls":38},{"$f":"M195=Sprachen!$L$4","v":false},0,{"$f":"O195=Sprachen!$L$4","v":false}]
["5.9",null,null,{"$f":"Sprachen!L327","v":"Sonstiges"},{"$nulls":38},{"$f":"M196=Sprachen!$L$4","v":false},0,{"$f":"O196=Sprachen!$L$4","v":false}]
["6. ",null,null,{"$f":"Sprachen!L230","v":"Nachweise zur Software"}]
[{"$f":"Sprachen!L325","v":"Softwarefreigabe erforderlich"}]
["6.1",null,null,{"$f":"Sprachen!L331","v":"SW-Einsatzfreigabe (z. B. Anlage 5 „Deckblatt PPF Software“)"},{"$nulls":8},{"$f":"IF(AU2=\"X\",Sprachen!L4,\"\")","v":""},null,{"$f":"IF(AU2=\"X\",Sprachen!L4,\"\")","v":""},{"$nulls":27},{"$f":"M199=Sprachen!$L$4","v":false},{"$f":"COUNTIF(Q199:T199,\"X\")","v":0},{"$f":"O199=Sprachen!$L$4","v":false}]
["6.2",null,null,{"$f":"Sprachen!L138","v":"Festlegung des Kontextes („Scope“) des zu liefernden Softwareproduktes"},{"$nulls":8},{"$f":"IF(AU2=\"X\",Sprachen!L4,\"\")","v":""},null,{"$f":"IF(AU2=\"X\",Sprachen!L4,\"\")","v":""},{"$nulls":27},{"$f":"M200=Sprachen!$L$4","v":false},{"$f":"COUNTIF(Q200:T200,\"X\")","v":0},{"$f":"O200=Sprachen!$L$4","v":false}]
["6.3",null,null,{"$f":"Sprachen!L297","v":"Referenz zu vertraglich festgelegten Qualitätsanforderungen\n(z. B. Coding Guidelines, Codemetriken, Testabdeckung)"},{"$nulls":8},{"$f":"IF(AU2=\"X\",Sprachen!L4,\"\")","v":""},null,{"$f":"IF(AU2=\"X\",Sprachen!L4,\"\")","v":""},{"$nulls":27},{"$f":"M201=Sprachen!$L$4","v":false},0,{"$f":"O201=Sprachen!$L$4","v":false}]
["6.4",null,null,{"$f":"Sprachen!L105","v":"Dokumentation der technischen SW-Spezifikationen"},{"$nulls":38},{"$f":"M202=Sprachen!$L$4","v":false},0,{"$f":"O202=Sprachen!$L$4","v":false}]
["6.5",null,null,{"$f":"Sprachen!L223","v":"Nachweis Umsetzung der Anforderungen 6.3 u. 6.4"},{"$nulls":38},{"$f":"M203=Sprachen!$L$4","v":false},0,{"$f":"O203=Sprachen!$L$4","v":false}]
["6.6",null,null,{"$f":"Sprachen!L111","v":"Dokumentation über FOSS (Free-and-Open-Source-Software)"},{"$nulls":8},{"$f":"IF(AU2=\"X\",Sprachen!L4,\"\")","v":""},null,{"$f":"IF(AU2=\"X\",Sprachen!L4,\"\")","v":""},{"$nulls":27},{"$f":"M204=Sprachen!$L$4","v":false},0,{"$f":"O204=Sprachen!$L$4","v":false}]
["6.7",null,null,{"$f":"Sprachen!L200","v":"Liste bekannter Fehler "},{"$nulls":8},{"$f":"IF(AU2=\"X\",Sprachen!L4,\"\")","v":""},null,{"$f":"IF(AU2=\"X\",Sprachen!L4,\"\")","v":""},{"$nulls":27},{"$f":"M205=Sprachen!$L$4","v":false},0,{"$f":"O205=Sprachen!$L$4","v":false}]
["6.8",null,null,{"$f":"Sprachen!L108","v":"Dokumentation der während der gesamten Projektlaufzeit eingesetzten Entwicklungswerkzeuge"},{"$nulls":38},{"$f":"M206=Sprachen!$L$4","v":false},0,{"$f":"O206=Sprachen!$L$4","v":false}]
["6.9",null,null,{"$f":"Sprachen!L109","v":"Dokumentation der während der gesamten Projektlaufzeit eingesetzten Testwerkzeuge"},{"$nulls":38},{"$f":"M207=Sprachen!$L$4","v":false},0,{"$f":"O207=Sprachen!$L$4","v":false}]
["6.10",null,null,{"$f":"Sprachen!L110","v":"Dokumentation des Versionsmanagements (Baseline, Konfigurationen, Änderungshistorie)"},{"$nulls":38},{"$f":"M208=Sprachen!$L$4","v":false},0,{"$f":"O208=Sprachen!$L$4","v":false}]
["6.11",null,null,{"$f":"Sprachen!L221","v":"Nachweis einer Prozessbewertung (z. B. Automotive Spice)"},{"$nulls":38},{"$f":"M209=Sprachen!$L$4","v":false},0,{"$f":"O209=Sprachen!$L$4","v":false}]
[{"$nulls":3},{"$f":"Sprachen!L284","v":"Produktionsprozessabnahme erforderlich"}]
[{"$nulls":3},{"$f":"Sprachen!L193","v":"Kundenteilnahme bei Prozessabnahme gewünscht"},{"$nulls":8},"Ja",null,{"$f":"Sprachen!L359","v":"Vereinbarte Vorgehensweise (z. B. Dauer bzw. Stückzahl des Tests)"}]
[{"$nulls":3},{"$f":"Sprachen!L293","v":"Prüfungen durch Kunde"}]
[{"$f":"Sprachen!L49","v":"Anwendung"},null,null,{"$f":"Sprachen!L293","v":"Prüfungen durch Kunde"},{"$nulls":8},{"$f":"Sprachen!L51","v":"Anzahl Musterteile"},null,{"$f":"Sprachen!L92","v":"Dauer in Arbeitstagen"},null,{"$f":"Sprachen!L57","v":"PPF-Verfahren"},null,{"$f":"Sprachen!L351","v":"Varianten-PPF"},null,{"$f":"Sprachen!L310","v":"Schritt bei gestuftem PPF-Verfahren"},{"$nulls":7},{"$f":"Sprachen!A381","v":"Bestandteil Requalifikation"},null,{"$f":"Sprachen!L48","v":"Ansprechpartner Kunde"}]
[{"$nulls":20},{"$f":"Sprachen!L306","v":"Stufe 1"},null,{"$f":"Sprachen!L307","v":"Stufe 2"},null,{"$f":"Sprachen!L308","v":"Stufe 3"},null,{"$f":"Sprachen!L309","v":"Stufe 4"},{"$nulls":15},"Anforderung vorhanden","Auswahl erfolgt","Vorlage erforderlich"]
[{"$nulls":3},{"$f":"Sprachen!L205","v":"Maß"},{"$nulls":38},{"$f":"A215=Sprachen!$L$4","v":false},{"$f":"COUNTIF(Q215:AB215,\"X\")","v":0},{"$f":"O215=Sprachen!$L$4","v":false}]
[{"$nulls":3},{"$f":"Sprachen!L144","v":"Funktion"},{"$nulls":38},{"$f":"A216=Sprachen!$L$4","v":false},0,{"$f":"O216=Sprachen!$L$4","v":false}]
[{"$nulls":3},{"$f":"Sprachen!L355","v":"Verbaubarkeit"},{"$nulls":38},{"$f":"A217=Sprachen!$L$4","v":false},0,{"$f":"O217=Sprachen!$L$4","v":false}]
[{"$nulls":3},{"$f":"Sprachen!L367","v":"Werkstoff"},{"$nulls":38},{"$f":"A218=Sprachen!$L$4","v":false},0,{"$f":"O218=Sprachen!$L$4","v":false}]
[{"$nulls":3},{"$f":"Sprachen!L185","v":"Korrosion"},{"$nulls":38},{"$f":"A219=Sprachen!$L$4","v":false},0,{"$f":"O219=Sprachen!$L$4","v":false}]
[{"$nulls":3},{"$f":"Sprachen!L195","v":"Lacktechnik"},{"$nulls":38},{"$f":"A220=Sprachen!$L$4","v":false},0,{"$f":"O220=Sprachen!$L$4","v":false}]
[{"$nulls":3},{"$f":"Sprachen!L133","v":"Farbton"},{"$nulls":38},{"$f":"A221=Sprachen!$L$4","v":false},0,{"$f":"O221=Sprachen!$L$4","v":false}]
[{"$nulls":3},{"$f":"Sprachen!L251","v":"Oberfläche, Narbung"},{"$nulls":38},{"$f":"A222=Sprachen!$L$4","v":false},0,{"$f":"O222=Sprachen!$L$4","v":false}]
[{"$nulls":3},{"$f":"Sprachen!L282","v":"Prozess"},{"$nulls":38},{"$f":"A223=Sprachen!$L$4","v":false},0,{"$f":"O223=Sprachen!$L$4","v":false}]
[{"$nulls":42},{"$f":"A224=Sprachen!$L$4","v":false},0,{"$f":"O224=Sprachen!$L$4","v":false}]
[{"$nulls":42},{"$f":"A225=Sprachen!$L$4","v":false},0,{"$f":"O225=Sprachen!$L$4","v":false}]
[{"$nulls":42},{"$f":"A226=Sprachen!$L$4","v":false},0,{"$f":"O226=Sprachen!$L$4","v":false}]
[{"$nulls":42},{"$f":"A227=Sprachen!$L$4","v":false},0,{"$f":"O227=Sprachen!$L$4","v":false}]
[{"$nulls":42},{"$f":"A228=Sprachen!$L$4","v":false},0,{"$f":"O228=Sprachen!$L$4","v":false}]
[{"$nulls":42},{"$f":"A229=Sprachen!$L$4","v":false},0,{"$f":"O229=Sprachen!$L$4","v":false}]
[{"$nulls":42},{"$f":"A230=Sprachen!$L$4","v":false},0,{"$f":"O230=Sprachen!$L$4","v":false}]
[{"$nulls":42},{"$f":"A231=Sprachen!$L$4","v":false},0,{"$f":"O231=Sprachen!$L$4","v":false}]
[{"$nulls":42},{"$f":"A232=Sprachen!$L$4","v":false},0,{"$f":"O232=Sprachen!$L$4","v":false}]
[{"$nulls":42},{"$f":"A233=Sprachen!$L$4","v":false},0,{"$f":"O233=Sprachen!$L$4","v":false}]
[null,null,{"$f":"Sprachen!L376","v":"Zur Verfügung zu stellende Schnittstellenbauteile und Hilfsmittel"}]
[null,null,{"$f":"Sprachen!L365","v":"Von der Organisation zur Verfügung zu stellen"},{"$nulls":17},{"$f":"Sprachen!L158","v":"ggf. Anhang für Auflistung aller betroffenen Sachnrn. verwenden"}]
[null,null,{"$f":"Sprachen!L65","v":"Benennung"},{"$nulls":8},{"$f":"Sprachen!L304","v":"Sachnummer"},{"$nulls":4},{"$f":"Sprachen!L361","v":"Version/ Datum"},{"$nulls":3},{"$f":"Sprachen!L70","v":"Bereitstellungs-termin"},{"$nulls":4},{"$f":"Sprachen!L69","v":"Bereitstellungsdauer"},{"$nulls":6},{"$f":"Sprachen!L179","v":"Kommentar"}]
[{"$nulls":42},{"$f":"COUNTA(C237:AP237)","v":0}]
[{"$nulls":42},{"$f":"COUNTA(C238:AP238)","v":0}]
[{"$nulls":42},0]
[{"$nulls":42},0]
[{"$nulls":42},0]
[{"$nulls":42},0]
[{"$nulls":42},0]
[null,null,{"$f":"Sprachen!L363","v":"Vom Kunden zur Verfügung zu stellen"},{"$nulls":17},{"$f":"Sprachen!L158","v":"ggf. Anhang für Auflistung aller betroffenen Sachnrn. verwenden"}]
[null,null,{"$f":"Sprachen!L65","v":"Benennung"},{"$nulls":8},{"$f":"Sprachen!L304","v":"Sachnummer"},{"$nulls":4},{"$f":"Sprachen!L361","v":"Version/ Datum"},{"$nulls":3},{"$f":"Sprachen!L70","v":"Bereitstellungs-termin"},{"$nulls":4},{"$f":"Sprachen!L69","v":"Bereitstellungsdauer"},{"$nulls":6},{"$f":"Sprachen!L179","v":"Kommentar"}]
[{"$nulls":42},{"$f":"COUNTA(C246:AP246)","v":0}]
[{"$nulls":42},{"$f":"COUNTA(C247:AP247)","v":0}]
[{"$nulls":42},0]
[{"$nulls":42},0]
[{"$nulls":42},0]
[{"$nulls":42},0]
[{"$nulls":42},0]
[null,null,{"$f":"Sprachen!L382","v":"Abstimmung Requalifikation"}]
[null,null,{"$f":"Sprachen!L383","v":"Requalifikationsintervall"}]
[null,null,{"$f":"Sprachen!L384","v":"Weitergabe an den Kunden"},{"$nulls":10},{"$f":"Sprachen!L48","v":"Ansprechpartner Kunde"}]
[{"$nulls":3},{"$f":"Sprachen!L385","v":"Nur Nachweis"},{"$nulls":9},{"$f":"Sprachen!L234","v":"Name"},{"$nulls":15},{"$f":"Sprachen!L20","v":"Abteilung"}]
[{"$nulls":3},{"$f":"Sprachen!L386","v":"Dokumentation"},{"$nulls":9},{"$f":"Sprachen!L119","v":"E-Mail/Fax-Nr."}]
[null,null,{"$f":"Sprachen!A387","v":"Liegen bei der Requalifikation Abweichungen zu den Spezifikationen vor, ist der Kunde in jedem Fall zu informieren."}]
[{"$f":"Sprachen!L181","v":"Kommentar Organisation"}]
[]
[{"$f":"Sprachen!L84","v":"Bestätigung Organisation"}]
[{"$f":"Sprachen!L234","v":"Name"},{"$nulls":7},{"$f":"IF(H24<>\"\",H24,\"\")","v":""},{"$nulls":12},{"$f":"Sprachen!L61","v":"Bemerkung"}]
[{"$f":"Sprachen!L20","v":"Abteilung"}]
[{"$f":"Sprachen!L343","v":"Telefon"},{"$nulls":7},{"$f":"IF(U24<>\"\",U24,\"\")","v":""}]
[{"$f":"Sprachen!L119","v":"E-Mail/Fax-Nr."},{"$nulls":7},{"$f":"IF(AB24<>\"\",AB24,\"\")","v":""}]
[{"$f":"Sprachen!L91","v":"Datum"},{"$nulls":20},{"$f":"Sprachen!L348","v":"Unterschrift"}]
[{"$f":"Sprachen!L180","v":"Kommentar Kunde"}]
[]
[{"$f":"Sprachen!L83","v":"Bestätigung Kunde"}]
[{"$f":"Sprachen!L234","v":"Name"},{"$nulls":7},{"$f":"IF(H15<>\"\",H15,\"\")","v":""},{"$nulls":12},{"$f":"Sprachen!L61","v":"Bemerkung"}]
[{"$f":"Sprachen!L20","v":"Abteilung"}]
[{"$f":"Sprachen!L343","v":"Telefon"},{"$nulls":7},{"$f":"IF(U15<>\"\",U15,\"\")","v":""}]
[{"$f":"Sprachen!L119","v":"E-Mail/Fax-Nr."},{"$nulls":7},{"$f":"IF(AB15<>\"\",AB15,\"\")","v":""}]
[{"$f":"Sprachen!L91","v":"Datum"},{"$nulls":20},{"$f":"Sprachen!L348","v":"Unterschrift"}]

{"sheet":"PPF-Bewertung","index":2,"n_rows":149,"n_cols":48,"rows_kept":149,"merged":[[0,0,1,12],[0,13,0,19],[0,20,0,39],[1,13,1,19],[1,20,1,39],[2,0,2,13],[2,14,2,26],[2,27,2,39],[3,0,3,6],[3,7,3,13],[3,14,3,20],[3,21,3,26],[3,27,4,33],[3,34,4,39],[4,0,4,6],[4,7,4,13],[4,14,4,20],[4,21,4,26],[5,0,5,6],[5,7,5,13],[5,14,5,20],[5,21,5,26],[5,27,5,33],[5,34,5,39],[6,0,6,6],[6,7,6,13],[6,14,6,20],[6,21,6,26],[6,27,6,33],[6,34,6,39],[7,0,7,6],[7,7,7,13],[7,14,7,20],[7,21,7,26],[7,27,7,33],[7,34,7,39],[8,0,8,6],[8,7,8,13],[8,14,8,20],[8,21,8,26],[8,27,8,33],[8,34,8,39],[9,0,9,6],[9,7,9,13],[9,14,9,20],[9,21,9,26],[9,27,9,33],[9,34,9,39],[10,0,10,6],[10,7,10,13],[10,14,10,20],[10,21,10,26],[10,27,10,33],[10,34,10,39],[11,0,11,13],[12,0,12,39],[13,0,13,2],[13,3,13,5],[13,6,13,11],[13,12,13,13],[13,14,13,15],[13,16,13,17],[13,18,13,26],[13,27,13,30],[13,31,13,39],[14,0,14,2],[14,3,14,11],[14,12,14,13],[14,14,14,15],[14,16,14,17],[14,18,14,26],[14,27,14,30],[14,31,14,39],[14,45,15,45],[14,46,15,46],[14,47,15,47],[15,0,15,2],[15,3,15,11],[15,12,15,13],[15,14,15,15],[15,16,15,17],[15,18,15,26],[15,27,15,30],[15,31,15,39],[16,0,16,17],[16,18,16,26],[17,0,17,2],[17,3,17,39],[18,0,18,2],[18,3,18,11],[18,12,18,13],[18,14,18,15],[18,16,18,17],[18,18,18,26],[18,27,18,30],[18,31,18,39],[18,45,22,45],[18,46,22,46],[18,47,22,47],[18,48,22,48],[19,0,19,2],[19,3,19,11],[19,12,19,13],[19,14,19,15],[19,16,19,17],[19,18,19,26],[19,27,19,30],[19,31,19,39],[20,0,20,2],[20,3,20,11],[20,12,20,13],[20,14,20,15],[20,16,20,17],[20,18,20,26],[20,27,20,30],[20,31,20,39],[21,0,21,2],[21,3,21,11],[21,12,21,13],[21,14,21,15],[21,16,21,17],[21,18,21,26],[21,27,21,30],[21,31,21,39],[22,0,22,2],[22,3,22,11],[22,12,22,13],[22,14,22,15],[22,16,22,17],[22,18,22,26],[22,27,22,30],[22,31,22,39],[23,0,23,2],[23,3,23,39],[24,0,24,2],[24,3,24,11],[24,12,24,13],[24,14,24,15],[24,16,24,17],[24,18,24,26],[24,27,24,30],[24,31,24,39],[24,45,26,45],[24,46,26,46],[24,47,26,47],[24,48,26,48],[25,0,25,2],[25,3,25,11],[25,12,25,13],[25,14,25,15],[25,16,25,17],[25,18,25,26],[25,27,25,30],[25,31,25,39],[26,0,26,2],[26,3,26,11],[26,12,26,13],[26,14,26,15],[26,16,26,17],[26,18,26,26],[26,27,26,30],[26,31,26,39],[27,0,27,2],[27,3,27,39],[28,0,28,2],[28,3,28,11],[28,12,28,13],[28,14,28,15],[28,16,28,17],[28,18,28,26],[28,27,28,30],[28,31,28,39],[28,45,40,45],[28,46,40,46],[28,47,40,47],[28,48,40,48],[29,0,29,2],[29,3,29,11],[29,12,29,13],[29,14,29,15],[29,16,29,17],[29,18,29,26],[29,27,29,30],[29,31,29,39],[30,0,30,2],[30,3,30,11],[30,12,30,13],[30,14,30,15],[30,16,30,17],[30,18,30,26],[30,27,30,30],[30,31,30,39],[31,0,31,2],[31,3,31,11],[31,12,31,13],[31,14,31,15],[31,16,31,17],[31,18,31,26],[31,27,31,30],[31,31,31,39],[32,0,32,2],[32,3,32,11],[32,12,32,13],[32,14,32,15],[32,16,32,17],[32,18,32,26],[32,27,32,30],[32,31,32,39],[33,0,33,2],[33,3,33,11],[33,12,33,13],[33,14,33,15],[33,16,33,17],[33,18,33,26],[33,27,33,30],[33,31,33,39],[34,0,34,2],[34,3,34,11],[34,12,34,13],[34,14,34,15],[34,16,34,17],[34,18,34,26],[34,27,34,30],[34,31,34,39],[35,0,35,2],[35,3,35,11],[35,12,35,13],[35,14,35,15],[35,16,35,17],[35,18,35,26],[35,27,35,30],[35,31,35,39],[36,0,36,2],[36,3,36,11],[36,12,36,13],[36,14,36,15],[36,16,36,17],[36,18,36,26],[36,27,36,30],[36,31,36,39],[37,0,37,2],[37,3,37,11],[37,12,37,13],[37,14,37,15],[37,16,37,17],[37,18,37,26],[37,27,37,30],[37,31,37,39],[38,0,38,2],[38,3,38,11],[38,12,38,13],[38,14,38,15],[38,16,38,17],[38,18,38,26],[38,27,38,30],[38,31,38,39],[39,0,39,2],[39,3,39,11],[39,12,39,13],[39,14,39,15],[39,16,39,17],[39,18,39,26],[39,27,39,30],[39,31,39,39],[40,0,40,2],[40,3,40,11],[40,12,40,13],[40,14,40,15],[40,16,40,17],[40,18,40,26],[40,27,40,30],[40,31,40,39],[41,0,41,2],[41,3,41,39],[42,0,42,2],[42,3,42,11],[42,12,42,13],[42,14,42,15],[42,16,42,17],[42,18,42,26],[42,27,42,30],[42,31,42,39],[42,45,47,45],[42,46,47,46],[42,47,47,47],[42,48,47,48],[43,0,43,2],[43,3,43,11],[43,12,43,13],[43,14,43,15],[43,16,43,17],[43,18,43,26],[43,27,43,30],[43,31,43,39],[44,0,44,2],[44,3,44,11],[44,12,44,13],[44,14,44,15],[44,16,44,17],[44,18,44,26],[44,27,44,30],[44,31,44,39],[45,0,45,2],[45,3,45,11],[45,12,45,13],[45,14,45,15],[45,16,45,17],[45,18,45,26],[45,27,45,30],[45,31,45,39],[46,0,46,2],[46,3,46,11],[46,12,46,13],[46,14,46,15],[46,16,46,17],[46,18,46,26],[46,27,46,30],[46,31,46,39],[47,0,47,2],[47,3,47,11],[47,12,47,13],[47,14,47,15],[47,16,47,17],[47,18,47,26],[47,27,47,30],[47,31,47,39],[48,0,48,2],[48,3,48,39],[49,0,49,2],[49,3,49,11],[49,12,49,13],[49,14,49,15],[49,16,49,17],[49,18,49,26],[49,27,49,30],[49,31,49,39],[49,45,57,45],[49,46,57,46],[49,47,57,47],[49,48,57,48],[50,0,50,2],[50,3,50,11],[50,12,50,13],[50,14,50,15],[50,16,50,17],[50,18,50,26],[50,27,50,30],[50,31,50,39],[51,0,51,2],[51,3,51,11],[51,12,51,13],[51,14,51,15],[51,16,51,17],[51,18,51,26],[51,27,51,30],[51,31,51,39],[52,0,52,2],[52,3,52,11],[52,12,52,13],[52,14,52,15],[52,16,52,17],[52,18,52,26],[52,27,52,30],[52,31,52,39],[53,0,53,2],[53,3,53,11],[53,12,53,13],[53,14,53,15],[53,16,53,17],[53,18,53,26],[53,27,53,30],[53,31,53,39],[54,0,54,2],[54,3,54,11],[54,12,54,13],[54,14,54,15],[54,16,54,17],[54,18,54,26],[54,27,54,30],[54,31,54,39],[55,0,55,2],[55,3,55,11],[55,12,55,13],[55,14,55,15],[55,16,55,17],[55,18,55,26],[55,27,55,30],[55,31,55,39],[56,0,56,2],[56,3,56,11],[56,12,56,13],[56,14,56,15],[56,16,56,17],[56,18,56,26],[56,27,56,30],[56,31,56,39],[57,0,57,2],[57,3,57,11],[57,12,57,13],[57,14,57,15],[57,16,57,17],[57,18,57,26],[57,27,57,30],[57,31,57,39],[58,0,58,2],[58,3,58,39],[59,0,59,17],[59,18,59,26],[60,0,60,2],[60,3,60,11],[60,12,60,13],[60,14,60,15],[60,16,60,17],[60,18,60,26],[60,27,60,30],[60,31,60,39],[60,45,70,45],[60,46,70,46],[60,47,70,47],[60,48,70,48],[61,0,61,2],[61,3,61,11],[61,12,61,13],[61,14,61,15],[61,16,61,17],[61,18,61,26],[61,27,61,30],[61,31,61,39],[62,0,62,2],[62,3,62,11],[62,12,62,13],[62,14,62,15],[62,16,62,17],[62,18,62,26],[62,27,62,30],[62,31,62,39],[63,0,63,2],[63,3,63,11],[63,12,63,13],[63,14,63,15],[63,16,63,17],[63,18,63,26],[63,27,63,30],[63,31,63,39],[64,0,64,2],[64,3,64,11],[64,12,64,13],[64,14,64,15],[64,16,64,17],[64,18,64,26],[64,27,64,30],[64,31,64,39],[65,0,65,2],[65,3,65,11],[65,12,65,13],[65,14,65,15],[65,16,65,17],[65,18,65,26],[65,27,65,30],[65,31,65,39],[66,0,66,2],[66,3,66,11],[66,12,66,13],[66,14,66,15],[66,16,66,17],[66,18,66,26],[66,27,66,30],[66,31,66,39],[67,0,67,2],[67,3,67,11],[67,12,67,13],[67,14,67,15],[67,16,67,17],[67,18,67,26],[67,27,67,30],[67,31,67,39],[68,0,68,2],[68,3,68,11],[68,12,68,13],[68,14,68,15],[68,16,68,17],[68,18,68,26],[68,27,68,30],[68,31,68,39],[69,0,69,2],[69,3,69,11],[69,12,69,13],[69,14,69,15],[69,16,69,17],[69,18,69,26],[69,27,69,30],[69,31,69,39],[70,0,70,2],[70,3,70,11],[70,12,70,13],[70,14,70,15],[70,16,70,17],[70,18,70,26],[70,27,70,30],[70,31,70,39],[71,0,71,39],[72,0,72,1],[72,2,72,19],[72,20,72,39],[73,0,106,1],[73,2,73,10],[73,11,73,15],[73,16,73,19],[73,20,73,30],[73,31,73,35],[73,36,73,39],[74,2,74,10],[74,11,74,15],[74,16,74,19],[74,20,74,30],[74,31,74,35],[74,36,74,39],[75,2,75,10],[75,11,75,15],[75,16,75,19],[75,20,75,30],[75,31,75,35],[75,36,75,39],[76,2,76,10],[76,11,76,15],[76,16,76,19],[76,20,76,30],[76,31,76,35],[76,36,76,39],[77,2,77,10],[77,11,77,15],[77,16,77,19],[77,20,77,30],[77,31,77,35],[77,36,77,39],[78,2,78,10],[78,11,78,15],[78,16,78,19],[78,20,78,30],[78,31,78,35],[78,36,78,39],[79,2,79,10],[79,11,79,15],[79,16,79,19],[79,20,79,30],[79,31,79,35],[79,36,79,39],[80,2,80,10],[80,11,80,15],[80,16,80,19],[80,20,80,30],[80,31,80,35],[80,36,80,39],[81,2,81,10],[81,11,81,15],[81,16,81,19],[81,20,81,30],[81,31,81,35],[81,36,81,39],[82,2,82,10],[82,11,82,15],[82,16,82,19],[82,20,82,30],[82,31,82,35],[82,36,82,39],[83,2,83,10],[83,11,83,15],[83,16,83,19],[83,20,83,30],[83,31,83,35],[83,36,83,39],[84,2,84,10],[84,11,84,15],[84,16,84,19],[84,20,84,30],[84,31,84,35],[84,36,84,39],[85,2,85,10],[85,11,85,15],[85,16,85,19],[85,20,85,30],[85,31,85,35],[85,36,85,39],[86,2,86,10],[86,11,86,15],[86,16,86,19],[86,20,86,30],[86,31,86,35],[86,36,86,39],[87,2,87,10],[87,11,87,15],[87,16,87,19],[87,20,87,30],[87,31,87,35],[87,36,87,39],[88,2,88,10],[88,11,88,15],[88,16,88,19],[88,20,88,30],[88,31,88,35],[88,36,88,39],[89,2,89,10],[89,11,89,15],[89,16,89,19],[89,20,89,30],[89,31,89,35],[89,36,89,39],[90,2,90,10],[90,11,90,15],[90,16,90,19],[90,20,90,30],[90,31,90,35],[90,36,90,39],[91,2,91,10],[91,11,91,15],[91,16,91,19],[91,20,91,30],[91,31,91,35],[91,36,91,39],[92,2,92,10],[92,11,92,15],[92,16,92,19],[92,20,92,30],[92,31,92,35],[92,36,92,39],[93,2,93,10],[93,11,93,15],[93,16,93,19],[93,20,93,30],[93,31,93,35],[93,36,93,39],[94,2,94,10],[94,11,94,15],[94,16,94,19],[94,20,94,30],[94,31,94,35],[94,36,94,39],[95,2,95,10],[95,11,95,15],[95,16,95,19],[95,20,95,30],[95,31,95,35],[95,36,95,39],[96,2,96,10],[96,11,96,15],[96,16,96,19],[96,20,96,30],[96,31,96,35],[96,36,96,39],[97,2,97,10],[97,11,97,15],[97,16,97,19],[97,20,97,30],[97,31,97,35],[97,36,97,39],[98,2,98,10],[98,11,98,15],[98,16,98,19],[98,20,98,30],[98,31,98,35],[98,36,98,39],[99,2,99,10],[99,11,99,15],[99,16,99,19],[99,20,99,30],[99,31,99,35],[99,36,99,39],[100,2,100,10],[100,11,100,15],[100,16,100,19],[100,20,100,30],[100,31,100,35],[100,36,100,39],[101,2,101,10],[101,11,101,15],[101,16,101,19],[101,20,101,30],[101,31,101,35],[101,36,101,39],[102,2,102,10],[102,11,102,15],[102,16,102,19],[102,20,102,30],[102,31,102,35],[102,36,102,39],[103,2,103,10],[103,11,103,15],[103,16,103,19],[103,20,103,30],[103,31,103,35],[103,36,103,39],[104,2,104,10],[104,11,104,15],[104,16,104,19],[104,20,104,30],[104,31,104,35],[104,36,104,39],[105,2,105,10],[105,11,105,15],[105,16,105,19],[105,20,105,30],[105,31,105,35],[105,36,105,39],[106,2,106,10],[106,11,106,15],[106,16,106,19],[106,20,106,30],[106,31,106,35],[106,36,106,39],[107,0,107,39],[108,0,108,11],[108,12,108,13],[108,14,108,15],[108,16,108,17],[108,18,108,20],[108,21,108,23],[108,24,108,26],[108,27,108,35],[108,36,108,39],[109,0,109,11],[109,12,109,13],[109,14,109,15],[109,16,109,17],[109,18,109,20],[109,21,109,23],[109,24,109,26],[109,27,109,35],[109,36,109,39],[110,0,110,11],[110,12,110,13],[110,14,110,15],[110,16,110,17],[110,18,110,20],[110,21,110,23],[110,24,110,26],[110,27,110,35],[110,36,110,39],[111,0,111,11],[111,12,111,13],[111,14,111,15],[111,16,111,17],[111,18,111,20],[111,21,111,23],[111,24,111,26],[111,27,111,35],[111,36,111,39],[112,0,112,11],[112,12,112,13],[112,14,112,15],[112,16,112,17],[112,18,112,20],[112,21,112,23],[112,24,112,26],[112,27,112,35],[112,36,112,39],[113,0,113,11],[113,12,113,13],[113,14,113,15],[113,16,113,17],[113,18,113,20],[113,21,113,23],[113,24,113,26],[113,27,113,35],[113,36,113,39],[114,0,114,39],[115,0,115,39],[116,0,116,39],[117,0,117,17],[117,18,117,19],[117,20,117,37],[117,38,117,39],[118,0,118,39],[119,0,119,7],[119,8,119,20],[119,21,122,25],[119,26,122,39],[120,0,120,7],[120,8,120,20],[121,0,121,7],[121,8,121,20],[122,0,122,7],[122,8,122,20],[123,0,123,7],[123,8,123,20],[123,21,123,25],[123,26,123,39],[124,0,124,39],[125,0,125,17],[125,18,125,19],[125,20,125,37],[125,38,125,39],[126,0,126,17],[126,18,126,19],[126,20,127,37],[126,38,127,39],[127,0,127,17],[127,18,127,19],[128,0,128,9],[128,10,128,39],[129,0,133,9],[129,10,129,14],[129,15,129,39],[130,10,130,14],[130,15,130,39],[131,10,131,14],[131,15,131,39],[132,10,132,14],[132,15,132,39],[133,10,133,14],[133,15,133,39],[134,0,138,9],[134,10,134,14],[134,15,134,39],[135,10,135,14],[135,15,135,39],[136,10,136,14],[136,15,136,39],[137,10,137,14],[137,15,137,39],[138,10,138,14],[138,15,138,39],[139,0,143,9],[139,10,139,14],[139,15,139,34],[139,35,139,39],[140,10,140,14],[140,15,140,34],[140,35,140,39],[141,10,141,14],[141,15,141,34],[141,35,141,39],[142,10,142,14],[142,15,142,34],[142,35,142,39],[143,10,143,14],[143,15,143,34],[143,35,143,39],[144,0,144,7],[144,8,144,20],[144,21,147,25],[144,26,147,39],[145,0,145,7],[145,8,145,20],[146,0,146,7],[146,8,146,20],[147,0,147,7],[147,8,147,20],[148,0,148,7],[148,8,148,20],[148,21,148,25],[148,26,148,39]]}
[{"$f":"Sprachen!L263","v":"PPF-Bewertung"},{"$nulls":12},{"$f":"Sprachen!L378","v":"Bericht"},{"$nulls":6},{"$f":"IF(H4<>\"\",H4&\" / \"&H5,\"\")","v":""},{"$nulls":20},"Sprachauswahl",1,"Hardwarebemusterung erforderlich",{"$f":"IF(S17=Sprachen!L4,\"X\",\"N\")","v":"N"}]
[{"$nulls":13},{"$f":"Sprachen!L255","v":"Organisation"},{"$nulls":6},{"$f":"IF('Deckblatt '!U2<>\"\",'Deckblatt '!U2,\"\")","v":""},{"$nulls":22},"Softwarebemusterung erforderlich",{"$f":"IF(S60=Sprachen!L4,\"X\",\"N\")","v":"N"}]
[{"$f":"Sprachen!L46","v":"Angaben zur Organisation"},{"$nulls":13},{"$f":"Sprachen!L44","v":"Angaben zu Mustern"},{"$nulls":12},{"$f":"Sprachen!L45","v":"Angaben zum Kunden"},{"$nulls":13},{"$f":"'Deckblatt '!AP2","v":"Deutsch"}]
[{"$f":"Sprachen!L75","v":"Berichtsnummer"},{"$nulls":6},{"$f":"IF('Deckblatt '!H16<>\"\",'Deckblatt '!H16,\"\")","v":""},{"$nulls":6},{"$f":"Sprachen!L198","v":"Lieferscheinnummer"},{"$nulls":6},{"$f":"IF('Deckblatt '!V16<>\"\",'Deckblatt '!V16,\"\")","v":""},{"$nulls":5},{"$f":"Sprachen!L187","v":"Kunde"},{"$nulls":6},{"$f":"IF('Deckblatt '!A10<>\"\",'Deckblatt '!A10,\"\")","v":""}]
[{"$f":"Sprachen!L77","v":"Berichtsversion"},{"$nulls":6},{"$f":"IF('Deckblatt '!H17<>\"\",'Deckblatt '!H17,\"\")","v":""},{"$nulls":6},{"$f":"Sprachen!L197","v":"Liefermenge"},{"$nulls":6},{"$f":"IF('Deckblatt '!V17<>\"\",'Deckblatt '!V17,\"\")","v":""}]
[{"$f":"Sprachen!L199","v":"Lieferstandort"},{"$nulls":6},{"$f":"IF('Deckblatt '!H18<>\"\",'Deckblatt '!H18,\"\")","v":""},{"$nulls":6},{"$f":"Sprachen!L89","v":"Chargennummer"},{"$nulls":6},{"$f":"IF('Deckblatt '!V18<>\"\",'Deckblatt '!V18,\"\")","v":""},{"$nulls":5},{"$f":"Sprachen!L87","v":"Bestellnr. PPF-Muster"},{"$nulls":6},{"$f":"IF('Deckblatt '!AI18<>\"\",'Deckblatt '!AI18,\"\")","v":""}]
[{"$f":"Sprachen!L276","v":"Produktionsstandort"},{"$nulls":6},{"$f":"IF('Deckblatt '!H19<>\"\",'Deckblatt '!H19,\"\")","v":""},{"$nulls":6},{"$f":"Sprachen!L217","v":"Mustergewicht [kg]"},{"$nulls":6},{"$f":"IF('Deckblatt '!V19<>\"\",'Deckblatt '!V19,\"\")","v":""},{"$nulls":5},{"$f":"Sprachen!L14","v":"Abladestelle"},{"$nulls":6},{"$f":"IF('Deckblatt '!AI19<>\"\",'Deckblatt '!AI19,\"\")","v":""}]
[{"$f":"Sprachen!L304","v":"Sachnummer"},{"$nulls":6},{"$f":"IF('Deckblatt '!H20<>\"\",'Deckblatt '!H20,\"\")","v":""},{"$nulls":6},{"$f":"Sprachen!L166","v":"Hardwarestand"},{"$nulls":6},{"$f":"IF('Deckblatt '!V20<>\"\",'Deckblatt '!V20,\"\")","v":""},{"$nulls":5},{"$f":"Sprachen!L304","v":"Sachnummer"},{"$nulls":6},{"$f":"IF('Deckblatt '!AI20<>\"\",'Deckblatt '!AI20,\"\")","v":""}]
[{"$f":"Sprachen!L65","v":"Benennung"},{"$nulls":6},{"$f":"IF('Deckblatt '!H21<>\"\",'Deckblatt '!H21,\"\")","v":""},{"$nulls":6},{"$f":"Sprachen!L98","v":"Diagnosestand"},{"$nulls":6},{"$f":"IF('Deckblatt '!V21<>\"\",'Deckblatt '!V21,\"\")","v":""},{"$nulls":5},{"$f":"Sprachen!L65","v":"Benennung"},{"$nulls":6},{"$f":"IF('Deckblatt '!AI21<>\"\",'Deckblatt '!AI21,\"\")","v":""}]
[{"$f":"Sprachen!L374","v":"Zeichnungsnummer"},{"$nulls":6},{"$f":"IF('Deckblatt '!H22<>\"\",'Deckblatt '!H22,\"\")","v":""},{"$nulls":6},{"$f":"Sprachen!L326","v":"Softwarestand"},{"$nulls":6},{"$f":"IF('Deckblatt '!V22<>\"\",'Deckblatt '!V22,\"\")","v":""},{"$nulls":5},{"$f":"Sprachen!L374","v":"Zeichnungsnummer"},{"$nulls":6},{"$f":"IF('Deckblatt '!AI22<>\"\",'Deckblatt '!AI22,\"\")","v":""}]
[{"$f":"Sprachen!L361","v":"Version/ Datum"},{"$nulls":6},{"$f":"IF('Deckblatt '!H23<>\"\",'Deckblatt '!H23,\"\")","v":""},{"$nulls":6},{"$f":"Sprachen!L177","v":"Kennung/DUNS"},{"$nulls":6},{"$f":"IF('Deckblatt '!V23<>\"\",'Deckblatt '!V23,\"\")","v":""},{"$nulls":5},{"$f":"Sprachen!L361","v":"Version/ Datum"},{"$nulls":6},{"$f":"IF('Deckblatt '!AI23<>\"\",'Deckblatt '!AI23,\"\")","v":""}]
[{"$f":"IF('Deckblatt '!A24:N24<>\"\",'Deckblatt '!A24:N24,\"\")","v":"-"}]
[{"$f":"Sprachen!L115","v":"Einzelbewertung durch die Organisation"}]
[{"$f":"Sprachen!L253","v":"Ordnungs-    nummer"},null,null,{"$f":"Sprachen!L289","v":"Prüfgebiet"},null,null,{"$f":"Sprachen!L12","v":"(sofern für das Produkt zutreffend)"},{"$nulls":5},{"$f":"Sprachen!L366","v":"Vorlage erforderlich"},null,{"$f":"Sprachen!L43","v":"Anforderungen vollständig erfüllt"},null,{"$f":"Sprachen!L42","v":"Anforderungen nicht vollständig erfüllt"},null,{"$f":"Sprachen!L224","v":"Nachweis-      \ndokument"},{"$nulls":8},{"$f":"Sprachen!L361","v":"Version/ Datum"},{"$nulls":3},{"$f":"Sprachen!L61","v":"Bemerkung"},{"$nulls":8},"Kategorie gefordert","rückgemeldet","0: gefordert und rückgemeldet: \n-1: gefordert nicht rückgemeldet",null,"i.O.","Nicht vollständig befüllt","Vollständig und i.O.","Nicht i.O."]
["0.1",null,null,{"$f":"Sprachen!L94","v":"PPF-Deckblatt/PPF-Bewertung"},{"$nulls":36},{"$f":"IF(M15=Sprachen!$L$4,\"J\",\"N\")","v":"N"},{"$f":"IF(OR(O15=\"X\",Q15=\"X\"),\"J\",\"N\")","v":"N"},{"$f":"IF(AND(AO15=\"J\",AP15=\"J\"),0,IF(AND(AO15=\"J\",AP15=\"N\"),-1,\"\"))","v":""},null,{"$f":"IF(O15=\"X\",\"J\",IF(AP15=\"N\",IF(AQ15=-1,\"Fehlt\",\"\"),\"N\"))","v":""},{"$f":"IF(IFERROR(VLOOKUP(\"Fehlt\",AS15:AS16,1,FALSE)=\"Fehlt\",FALSE),\"X\",\"\")","v":""},{"$f":"IF(OR(IFERROR(VLOOKUP(\"N\",AS15:AS16,1,FALSE),FALSE)=\"N\",IFERROR(VLOOKUP(\"Fehlt\",AS15:AS16,1,FALSE),FALSE)=\"Fehlt\")=FALSE,\"X\",\"\")","v":"X"},{"$f":"IF(IFERROR(VLOOKUP(\"N\",AS15:AS16,1,FALSE),FALSE)=\"N\",\"X\",\"\")","v":""}]
["0.2",null,null,{"$f":"Sprachen!L313","v":"Selbstbeurteilung Produkt, Produktionsprozess und ggf. Software"},{"$nulls":36},{"$f":"IF(M16=Sprachen!$L$4,\"J\",\"N\")","v":"N"},{"$f":"IF(OR(O16=\"X\",Q16=\"X\"),\"J\",\"N\")","v":"N"},{"$f":"IF(AND(AO16=\"J\",AP16=\"J\"),0,IF(AND(AO16=\"J\",AP16=\"N\"),-1,\"\"))","v":""},null,{"$f":"IF(O16=\"X\",\"J\",IF(AP16=\"N\",IF(AQ16=-1,\"Fehlt\",\"\"),\"N\"))","v":""}]
[{"$f":"Sprachen!L165","v":"Hardwarefreigabe erforderlich"}]
["1. ",null,null,{"$f":"Sprachen!L228","v":"Nachweise zur Produktentwicklung"}]
["1.1",null,null,{"$f":"Sprachen!L334","v":"Technische Spezifikationen "},{"$nulls":36},{"$f":"IF(M19=Sprachen!$L$4,\"J\",\"N\")","v":"N"},{"$f":"IF(OR(O19=\"X\",Q19=\"X\"),\"J\",\"N\")","v":"N"},{"$f":"IF(AND(AO19=\"J\",AP19=\"J\"),0,IF(AND(AO19=\"J\",AP19=\"N\"),-1,\"\"))","v":""},null,{"$f":"IF(O19=\"X\",\"J\",IF(AP19=\"N\",IF(AQ19=-1,\"Fehlt\",\"\"),\"N\"))","v":""},{"$f":"IF(IFERROR(VLOOKUP(\"Fehlt\",AS19:AS23,1,FALSE)=\"Fehlt\",FALSE),\"X\",\"\")","v":""},{"$f":"IF(OR(IFERROR(VLOOKUP(\"N\",AS19:AS23,1,FALSE),FALSE)=\"N\",IFERROR(VLOOKUP(\"Fehlt\",AS19:AS23,1,FALSE),FALSE)=\"Fehlt\")=FALSE,\"X\",\"\")","v":"X"},{"$f":"IF(IFERROR(VLOOKUP(\"N\",AS19:AS23,1,FALSE),FALSE)=\"N\",\"X\",\"\")","v":""}]
["1.2",null,null,{"$f":"Sprachen!L150","v":"Genehmigte Konstruktionsänderungen"},{"$nulls":36},{"$f":"IF(M20=Sprachen!$L$4,\"J\",\"N\")","v":"N"},"N","",null,""]
["1.3",null,null,{"$f":"Sprachen!L182","v":"Konstruktions-, Entwicklungsfreigaben"},{"$nulls":36},{"$f":"IF(M21=Sprachen!$L$4,\"J\",\"N\")","v":"N"},"N","",null,""]
["1.4",null,null,{"$f":"Sprachen!L209","v":"Materialdaten per IMDS"},{"$nulls":36},{"$f":"IF(M22=Sprachen!$L$4,\"J\",\"N\")","v":"N"},"N","",null,""]
["1.5",null,null,{"$f":"Sprachen!L97","v":"Design-FMEA"},{"$nulls":36},{"$f":"IF(M23=Sprachen!$L$4,\"J\",\"N\")","v":"N"},"N","",null,""]
["2. ",null,null,{"$f":"Sprachen!L229","v":"Nachweise zur Produktionsprozessentwicklung"},{"$nulls":36},{"$f":"IF(M24=Sprachen!$L$4,\"J\",\"N\")","v":"N"}]
["2.1",null,null,{"$f":"Sprachen!L283","v":"Prozessablaufdiagramm"},{"$nulls":36},{"$f":"IF(M25=Sprachen!$L$4,\"J\",\"N\")","v":"N"},{"$f":"IF(OR(O25=\"X\",Q25=\"X\"),\"J\",\"N\")","v":"N"},{"$f":"IF(AND(AO25=\"J\",AP25=\"J\"),0,IF(AND(AO25=\"J\",AP25=\"N\"),-1,\"\"))","v":""},null,{"$f":"IF(O25=\"X\",\"J\",IF(AP25=\"N\",IF(AQ25=-1,\"Fehlt\",\"\"),\"N\"))","v":""},{"$f":"IF(IFERROR(VLOOKUP(\"Fehlt\",AS25:AS27,1,FALSE)=\"Fehlt\",FALSE),\"X\",\"\")","v":""},{"$f":"IF(OR(IFERROR(VLOOKUP(\"N\",AS25:AS27,1,FALSE),FALSE)=\"N\",IFERROR(VLOOKUP(\"Fehlt\",AS25:AS27,1,FALSE),FALSE)=\"Fehlt\")=FALSE,\"X\",\"\")","v":"X"},{"$f":"IF(IFERROR(VLOOKUP(\"N\",AS25:AS27,1,FALSE),FALSE)=\"N\",\"X\",\"\")","v":""}]
["2.2",null,null,{"$f":"Sprachen!L287","v":"Prozess-FMEA"},{"$nulls":36},{"$f":"IF(M26=Sprachen!$L$4,\"J\",\"N\")","v":"N"},"N","",null,""]
["2.3",null,null,{"$f":"Sprachen!L275","v":"Produktionslenkungsplan"},{"$nulls":36},{"$f":"IF(M27=Sprachen!$L$4,\"J\",\"N\")","v":"N"},"N","",null,""]
["3. ",null,null,{"$f":"Sprachen!L231","v":"Nachweise zur Validierung des Produktes"},{"$nulls":36},{"$f":"IF(M28=Sprachen!$L$4,\"J\",\"N\")","v":"N"}]
["3.1",null,null,{"$f":"Sprachen!L153","v":"Geometrie, Maß"},{"$nulls":36},{"$f":"IF(M29=Sprachen!$L$4,\"J\",\"N\")","v":"N"},{"$f":"IF(OR(O29=\"X\",Q29=\"X\"),\"J\",\"N\")","v":"N"},{"$f":"IF(AND(AO29=\"J\",AP29=\"J\"),0,IF(AND(AO29=\"J\",AP29=\"N\"),-1,\"\"))","v":""},null,{"$f":"IF(O29=\"X\",\"J\",IF(AP29=\"N\",IF(AQ29=-1,\"Fehlt\",\"\"),\"N\"))","v":""},{"$f":"IF(IFERROR(VLOOKUP(\"Fehlt\",AS29:AS41,1,FALSE)=\"Fehlt\",FALSE),\"X\",\"\")","v":""},{"$f":"IF(OR(IFERROR(VLOOKUP(\"N\",AS29:AS41,1,FALSE),FALSE)=\"N\",IFERROR(VLOOKUP(\"Fehlt\",AS29:AS41,1,FALSE),FALSE)=\"Fehlt\")=FALSE,\"X\",\"\")","v":"X"},{"$f":"IF(IFERROR(VLOOKUP(\"N\",AS29:AS41,1,FALSE),FALSE)=\"N\",\"X\",\"\")","v":""}]
["3.2",null,null,{"$f":"Sprachen!L368","v":"Werkstoff (Festigkeit, physikalische Eigenschaften, …)"},{"$nulls":36},{"$f":"IF(M30=Sprachen!$L$4,\"J\",\"N\")","v":"N"},{"$f":"IF(OR(O30=\"X\",Q30=\"X\"),\"J\",\"N\")","v":"N"},{"$f":"IF(AND(AO30=\"J\",AP30=\"J\"),0,IF(AND(AO30=\"J\",AP30=\"N\"),-1,\"\"))","v":""},null,{"$f":"IF(O30=\"X\",\"J\",IF(AP30=\"N\",IF(AQ30=-1,\"Fehlt\",\"\"),\"N\"))","v":""}]
["3.3",null,null,{"$f":"Sprachen!L144","v":"Funktion"},{"$nulls":36},{"$f":"IF(M31=Sprachen!$L$4,\"J\",\"N\")","v":"N"},"N","",null,""]
["3.4",null,null,{"$f":"Sprachen!L161","v":"Haptik"},{"$nulls":36},{"$f":"IF(M32=Sprachen!$L$4,\"J\",\"N\")","v":"N"},"N","",null,""]
["3.5",null,null,{"$f":"Sprachen!L27","v":"Akustik"},{"$nulls":36},{"$f":"IF(M33=Sprachen!$L$4,\"J\",\"N\")","v":"N"},"N","",null,""]
["3.6",null,null,{"$f":"Sprachen!L154","v":"Geruch"},{"$nulls":36},{"$f":"IF(M34=Sprachen!$L$4,\"J\",\"N\")","v":"N"},"N","",null,""]
["3.7",null,null,{"$f":"Sprachen!L56","v":"Aussehen"},{"$nulls":36},{"$f":"IF(M35=Sprachen!$L$4,\"J\",\"N\")","v":"N"},"N","",null,""]
["3.8",null,null,{"$f":"Sprachen!L252","v":"Oberflächenanforderung"},{"$nulls":36},{"$f":"IF(M36=Sprachen!$L$4,\"J\",\"N\")","v":"N"},"N","",null,""]
["3.9",null,null,{"$f":"Sprachen!L333","v":"Technische Sauberkeit"},{"$nulls":36},{"$f":"IF(M37=Sprachen!$L$4,\"J\",\"N\")","v":"N"},"N","",null,""]
["3.10",null,null,{"$f":"Sprachen!L377","v":"Zuverlässigkeit"},{"$nulls":36},{"$f":"IF(M38=Sprachen!$L$4,\"J\",\"N\")","v":"N"},"N","",null,""]
["3.11",null,null,{"$f":"Sprachen!L82","v":"Beständigkeit gegenüber Electrostatic Discharge (ESD) "},{"$nulls":36},{"$f":"IF(M39=Sprachen!$L$4,\"J\",\"N\")","v":"N"},"N","",null,""]
["3.12",null,null,{"$f":"Sprachen!L117","v":"Elektrische Sicherheit / Hochvolt-Sicherheit"},{"$nulls":36},{"$f":"IF(M40=Sprachen!$L$4,\"J\",\"N\")","v":"N"},"N","",null,""]
["3.13",null,null,{"$f":"Sprachen!L118","v":"Elektromagnetische Verträglichkeit (EMV)"},{"$nulls":36},{"$f":"IF(M41=Sprachen!$L$4,\"J\",\"N\")","v":"N"},"N","",null,""]
["4. ",null,null,{"$f":"Sprachen!L232","v":"Nachweise zur Validierung des Produktionsprozesses"}]
["4.1",null,null,{"$f":"Sprachen!L16","v":"Absicherung Besonderer Merkmale gemäß technischen Spezifikationen und vereinbarten Merkmalen (z. B. Poka Yoke, 100%-Prüfung, Prozessfähigkeiten, …)"},{"$nulls":36},{"$f":"IF(M43=Sprachen!$L$4,\"J\",\"N\")","v":"N"},{"$f":"IF(OR(O43=\"X\",Q43=\"X\"),\"J\",\"N\")","v":"N"},{"$f":"IF(AND(AO43=\"J\",AP43=\"J\"),0,IF(AND(AO43=\"J\",AP43=\"N\"),-1,\"\"))","v":""},null,{"$f":"IF(O43=\"X\",\"J\",IF(AP43=\"N\",IF(AQ43=-1,\"Fehlt\",\"\"),\"N\"))","v":""},{"$f":"IF(IFERROR(VLOOKUP(\"Fehlt\",AS43:AS48,1,FALSE)=\"Fehlt\",FALSE),\"X\",\"\")","v":""},{"$f":"IF(OR(IFERROR(VLOOKUP(\"N\",AS43:AS48,1,FALSE),FALSE)=\"N\",IFERROR(VLOOKUP(\"Fehlt\",AS43:AS48,1,FALSE),FALSE)=\"Fehlt\")=FALSE,\"X\",\"\")","v":"X"},{"$f":"IF(IFERROR(VLOOKUP(\"N\",AS43:AS48,1,FALSE),FALSE)=\"N\",\"X\",\"\")","v":""}]
["4.2",null,null,{"$f":"Sprachen!L194","v":"Laborqualifizierung"},{"$nulls":36},{"$f":"IF(M44=Sprachen!$L$4,\"J\",\"N\")","v":"N"},"N","",null,""]
["4.3",null,null,{"$f":"Sprachen!L216","v":"Muster inkl. Fertigungsdokumentation"},{"$nulls":36},{"$f":"IF(M45=Sprachen!$L$4,\"J\",\"N\")","v":"N"},"N","",null,""]
["4.4",null,null,{"$f":"Sprachen!L300","v":"Referenzmuster"},{"$nulls":36},{"$f":"IF(M46=Sprachen!$L$4,\"J\",\"N\")","v":"N"},"N","",null,""]
["4.5",null,null,{"$f":"Sprachen!L274","v":"Produktionskapazität"},{"$nulls":36},{"$f":"IF(M47=Sprachen!$L$4,\"J\",\"N\")","v":"N"},"N","",null,""]
["4.6",null,null,{"$f":"Sprachen!L371","v":"Werkzeuge"},{"$nulls":36},{"$f":"IF(M48=Sprachen!$L$4,\"J\",\"N\")","v":"N"},"N","",null,""]
["5. ",null,null,{"$f":"Sprachen!L152","v":"Generelle Nachweise"}]
["5.1",null,null,{"$f":"Sprachen!L226","v":"Nachweise zur Einhaltung gesetzlicher Anforderungen "},{"$nulls":36},{"$f":"IF(M50=Sprachen!$L$4,\"J\",\"N\")","v":"N"},"N","",null,"",{"$f":"IF(IFERROR(VLOOKUP(\"Fehlt\",AS50:AS58,1,FALSE)=\"Fehlt\",FALSE),\"X\",\"\")","v":""},{"$f":"IF(OR(IFERROR(VLOOKUP(\"N\",AS50:AS58,1,FALSE),FALSE)=\"N\",IFERROR(VLOOKUP(\"Fehlt\",AS50:AS58,1,FALSE),FALSE)=\"Fehlt\")=FALSE,\"X\",\"\")","v":"X"},{"$f":"IF(IFERROR(VLOOKUP(\"N\",AS50:AS58,1,FALSE),FALSE)=\"N\",\"X\",\"\")","v":""}]
["5.2",null,null,{"$f":"Sprachen!L264","v":"PPF-Status Lieferkette"},{"$nulls":36},{"$f":"IF(M51=Sprachen!$L$4,\"J\",\"N\")","v":"N"},"N","",null,""]
["5.3",null,null,{"$f":"Sprachen!L292","v":"Prüfmittelliste Produkt und Produktionsprozess"},{"$nulls":36},{"$f":"IF(M52=Sprachen!$L$4,\"J\",\"N\")","v":"N"},"N","",null,""]
["5.4",null,null,{"$f":"Sprachen!L291","v":"Prüfmittelfähigkeitsnachweis Produkt u. Produktionsprozess"},{"$nulls":36},{"$f":"IF(M53=Sprachen!$L$4,\"J\",\"N\")","v":"N"},"N","",null,""]
["5.5",null,null,{"$f":"Sprachen!L341","v":"Teilelebenslauf"},{"$nulls":36},{"$f":"IF(M54=Sprachen!$L$4,\"J\",\"N\")","v":"N"},"N","",null,""]
["5.6",null,null,{"$f":"Sprachen!L113","v":"Eignungsnachweis der eingesetzten Ladungsträger inkl. Lagerung"},{"$nulls":36},{"$f":"IF(M55=Sprachen!$L$4,\"J\",\"N\")","v":"N"},"N","",null,""]
["5.7",null,null,{"$f":"Sprachen!L107","v":"Dokumentation der Vereinbarungen zum Befundungs- und Analyseprozess\n- Reklamationsbearbeitung (z.B. 8D)\n- Schadteilanalyse Feld"},{"$nulls":36},{"$f":"IF(M56=Sprachen!$L$4,\"J\",\"N\")","v":"N"},"N","",null,""]
["5.8",null,null,{"$f":"Sprachen!L106","v":"Dokumentation der Vereinbarung zur Requalifikation"},{"$nulls":36},{"$f":"IF(M57=Sprachen!$L$4,\"J\",\"N\")","v":"N"},"N","",null,""]
["5.9",null,null,{"$f":"Sprachen!L327","v":"Sonstiges"},{"$nulls":36},{"$f":"IF(M58=Sprachen!$L$4,\"J\",\"N\")","v":"N"},"N","",null,""]
["6. ",null,null,{"$f":"Sprachen!L230","v":"Nachweise zur Software"}]
[{"$f":"Sprachen!L325","v":"Softwarefreigabe erforderlich"},{"$nulls":17},{"$f":"IF('PPF Abstimmung'!S198<>\"\",'PPF Abstimmung'!S198,\"\")","v":""}]
["6.1",null,null,{"$f":"Sprachen!L331","v":"SW-Einsatzfreigabe (z. B. Anlage 5 „Deckblatt PPF Software“)"},{"$nulls":8},{"$f":"IF(AS2=\"X\",Sprachen!L4,\"\")","v":""},{"$nulls":27},{"$f":"IF(M61=Sprachen!$L$4,\"J\",\"N\")","v":"N"},{"$f":"IF(OR(O61=\"X\",Q61=\"X\"),\"J\",\"N\")","v":"N"},{"$f":"IF(AND(AO61=\"J\",AP61=\"J\"),0,IF(AND(AO61=\"J\",AP61=\"N\"),-1,\"\"))","v":""},null,{"$f":"IF(O61=\"X\",\"J\",IF(AP61=\"N\",IF(AQ61=-1,\"Fehlt\",\"\"),\"N\"))","v":""},{"$f":"IF(IFERROR(VLOOKUP(\"Fehlt\",AS61:AS71,1,FALSE)=\"Fehlt\",FALSE),\"X\",\"\")","v":""},{"$f":"IF(OR(IFERROR(VLOOKUP(\"N\",AS61:AS71,1,FALSE),FALSE)=\"N\",IFERROR(VLOOKUP(\"Fehlt\",AS61:AS71,1,FALSE),FALSE)=\"Fehlt\")=FALSE,\"X\",\"\")","v":"X"},{"$f":"IF(IFERROR(VLOOKUP(\"N\",AS61:AS71,1,FALSE),FALSE)=\"N\",\"X\",\"\")","v":""}]
["6.2",null,null,{"$f":"Sprachen!L138","v":"Festlegung des Kontextes („Scope“) des zu liefernden Softwareproduktes"},{"$nulls":8},{"$f":"IF(AS2=\"X\",Sprachen!L4,\"\")","v":""},{"$nulls":27},{"$f":"IF(M62=Sprachen!$L$4,\"J\",\"N\")","v":"N"},"N","",null,""]
["6.3",null,null,{"$f":"Sprachen!L297","v":"Referenz zu vertraglich festgelegten Qualitätsanforderungen\n(z. B. Coding Guidelines, Codemetriken, Testabdeckung)"},{"$nulls":8},{"$f":"IF(AS2=\"X\",Sprachen!L4,\"\")","v":""},{"$nulls":27},{"$f":"IF(M63=Sprachen!$L$4,\"J\",\"N\")","v":"N"},"N","",null,""]
["6.4",null,null,{"$f":"Sprachen!L105","v":"Dokumentation der technischen SW-Spezifikationen"},{"$nulls":36},{"$f":"IF(M64=Sprachen!$L$4,\"J\",\"N\")","v":"N"},"N","",null,""]
["6.5",null,null,{"$f":"Sprachen!L223","v":"Nachweis Umsetzung der Anforderungen 6.3 u. 6.4"},{"$nulls":36},{"$f":"IF(M65=Sprachen!$L$4,\"J\",\"N\")","v":"N"},"N","",null,""]
["6.6",null,null,{"$f":"Sprachen!L111","v":"Dokumentation über FOSS (Free-and-Open-Source-Software)"},{"$nulls":8},{"$f":"IF(AS2=\"X\",Sprachen!L4,\"\")","v":""},{"$nulls":27},{"$f":"IF(M66=Sprachen!$L$4,\"J\",\"N\")","v":"N"},"N","",null,""]
["6.7",null,null,{"$f":"Sprachen!L200","v":"Liste bekannter Fehler "},{"$nulls":8},{"$f":"IF(AS2=\"X\",Sprachen!L4,\"\")","v":""},{"$nulls":27},{"$f":"IF(M67=Sprachen!$L$4,\"J\",\"N\")","v":"N"},"N","",null,""]
["6.8",null,null,{"$f":"Sprachen!L108","v":"Dokumentation der während der gesamten Projektlaufzeit eingesetzten Entwicklungswerkzeuge"},{"$nulls":36},{"$f":"IF(M68=Sprachen!$L$4,\"J\",\"N\")","v":"N"},"N","",null,""]
["6.9",null,null,{"$f":"Sprachen!L109","v":"Dokumentation der während der gesamten Projektlaufzeit eingesetzten Testwerkzeuge"},{"$nulls":36},{"$f":"IF(M69=Sprachen!$L$4,\"J\",\"N\")","v":"N"},"N","",null,""]
["6.10",null,null,{"$f":"Sprachen!L110","v":"Dokumentation des Versionsmanagements (Baseline, Konfigurationen, Änderungshistorie)"},{"$nulls":36},{"$f":"IF(M70=Sprachen!$L$4,\"J\",\"N\")","v":"N"},"N","",null,""]
["6.11",null,null,{"$f":"Sprachen!L221","v":"Nachweis einer Prozessbewertung (z. B. Automotive Spice)"},{"$nulls":36},{"$f":"IF(M71=Sprachen!$L$4,\"J\",\"N\")","v":"N"},"N","",null,""]
[{"$f":"Sprachen!L340","v":"Teilebündelung/Produktfamilien"}]
[null,null,{"$f":"Sprachen!L267","v":"PPF-Verfahren für Produktfamilie"},{"$nulls":17},{"$f":"Sprachen!L158","v":"ggf. Anhang für Auflistung aller betroffenen Sachnrn. verwenden"}]
[null,null,{"$f":"Sprachen!L65","v":"Benennung"},{"$nulls":8},{"$f":"Sprachen!L304","v":"Sachnummer"},{"$nulls":4},{"$f":"Sprachen!L361","v":"Version/ Datum"},{"$nulls":3},{"$f":"Sprachen!L65","v":"Benennung"},{"$nulls":10},{"$f":"Sprachen!L304","v":"Sachnummer"},{"$nulls":4},{"$f":"Sprachen!L361","v":"Version/ Datum"}]
[{"$nulls":40},{"$f":"COUNTA(C75:AN75)","v":0}]
[{"$nulls":40},{"$f":"COUNTA(C76:AN76)","v":0}]
[{"$nulls":40},0]
[{"$nulls":40},0]
{"$rows_empty":25}
[{"$nulls":40},0]
[{"$nulls":40},0]
[{"$nulls":40},0]
[{"$nulls":40},0]
[{"$f":"Sprachen!L170","v":"Gesamtbewertung durch die Organisation"}]
[{"$f":"Sprachen!L233","v":"Nachweiskategorie"},{"$nulls":11},{"$f":"Sprachen!L366","v":"Vorlage erforderlich"},null,{"$f":"Sprachen!L43","v":"Anforderungen vollständig erfüllt"},null,{"$f":"Sprachen!L42","v":"Anforderungen nicht vollständig erfüllt"},null,{"$f":"Sprachen!L268","v":"PPF-Verfahren zum Kunden abgeschlossen"},null,null,{"$f":"Sprachen!L25","v":"Aktualisierte PPF-Dokumentation erforderlich"},null,null,{"$f":"Sprachen!L238","v":"Neues PPF-Verfahren erforderlich"},null,null,{"$f":"Sprachen!L302","v":"Risikobewertung"},{"$nulls":8},{"$f":"Sprachen!L361","v":"Version/ Datum"},{"$nulls":3},"Erforderlich","i.O","n.i.O.","unvollständig"]
[{"$f":"Sprachen!L31","v":"PPF-Deckblatt / PPF-Bewertung / Selbstbeurteilung"},{"$nulls":11},{"$f":"IF(AO110=\"J\",Sprachen!$L$4,\"\")","v":""},null,{"$f":"IF(AP110=\"J\",\"X\",\"\")","v":"X"},{"$nulls":25},{"$f":"IFERROR(VLOOKUP(\"J\",AO15:AO16,1,FALSE),\"N\")","v":"N"},{"$f":"IF(AU15=\"X\",\"J\",\"\")","v":"J"},{"$f":"IF(AV15=\"X\",\"J\",\"\")","v":""},{"$f":"IF(AT15=\"X\",TRUE,\"\")","v":""}]
[{"$f":"Sprachen!L227","v":"Nachweise zum Produkt"},{"$nulls":11},{"$f":"IF(AO111=\"J\",Sprachen!$L$4,\"\")","v":""},null,{"$f":"IF(M111=Sprachen!$L$4,IF(AP111=\"J\",\"X\",\"\"),\"\")","v":""},null,{"$f":"IF(AQ111=TRUE,\"X\",\"\")","v":""},{"$nulls":23},{"$f":"IF(OR(IFERROR(VLOOKUP(\"J\",AO19:AO23,1,FALSE),\"N\")=\"J\",IFERROR(VLOOKUP(\"J\",AO29:AO41,1,FALSE),\"N\")=\"J\")=TRUE,\"J\",\"N\")","v":"N"},{"$f":"IF(AND(AU19=\"X\",AU29=\"X\")=TRUE,\"J\",\"\")","v":"J"},{"$f":"OR(AV19=\"X\",AV29=\"X\")","v":false},{"$f":"OR(AT19=\"X\",AT29=\"X\")","v":false}]
[{"$f":"Sprachen!L225","v":"Nachweise zum Produktionsprozess"},{"$nulls":11},{"$f":"IF(AO112=\"J\",Sprachen!$L$4,\"\")","v":""},null,{"$f":"IF(M112=Sprachen!$L$4,IF(AP112=\"J\",\"X\",\"\"),\"\")","v":""},null,{"$f":"IF(AQ112=TRUE,\"X\",\"\")","v":""},{"$nulls":23},{"$f":"IF(OR(IFERROR(VLOOKUP(\"J\",AO25:AO27,1,FALSE),\"N\")=\"J\",IFERROR(VLOOKUP(\"J\",AO43:AO48,1,FALSE),\"N\")=\"J\")=TRUE,\"J\",\"N\")","v":"N"},{"$f":"IF(AND(AU25=\"X\",AU43=\"X\")=TRUE,\"J\",\"\")","v":"J"},{"$f":"OR(AV25=\"X\",AV43=\"X\")","v":false},{"$f":"OR(AT25=\"X\",AT43=\"X\")","v":false}]
[{"$f":"Sprachen!L151","v":"Generelle Nachweise"},{"$nulls":11},{"$f":"IF(AO113=\"J\",Sprachen!$L$4,\"\")","v":""},null,{"$f":"IF(M113=Sprachen!$L$4,IF(AP113=\"J\",\"X\",\"\"),\"\")","v":""},null,{"$f":"IF(AQ113=\"J\",\"X\",\"\")","v":""},{"$nulls":23},{"$f":"IFERROR(VLOOKUP(\"J\",AO50:AO58,1,FALSE),\"N\")","v":"N"},{"$f":"IF(AU50=\"X\",\"J\",\"\")","v":"J"},{"$f":"IF(AV50=\"X\",\"J\",\"\")","v":""},{"$f":"IF(AT50=\"X\",TRUE,\"\")","v":""}]
[{"$f":"Sprachen!L323","v":"Nachweise zur Software"},{"$nulls":11},{"$f":"IF(AO114=\"J\",Sprachen!$L$4,\"\")","v":""},null,{"$f":"IF(M114=Sprachen!$L$4,IF(AP114=\"J\",\"X\",\"\"),\"\")","v":""},null,"",{"$nulls":23},{"$f":"IFERROR(VLOOKUP(\"J\",AO61:AO71,1,FALSE),\"N\")","v":"N"},{"$f":"IF(AU61=\"X\",\"J\",\"\")","v":"J"},{"$f":"IF(AV61=\"X\",\"J\",\"\")","v":""},{"$f":"IF(AT61=\"X\",TRUE,\"\")","v":""}]
[{"$f":"Sprachen!L181","v":"Kommentar Organisation"}]
[]
[{"$f":"Sprachen!L122","v":"Empfehlung durch die Organisation"}]
[{"$f":"Sprachen!L191","v":"Kundentauglich/Serientauglich"},{"$nulls":17},{"$f":"IF(AND(AM118=\"\",AX110>0),\"X\",\"\")","v":""},null,{"$f":"Sprachen!L242","v":"Nicht kundentauglich/ \nNicht serientauglich"},{"$nulls":17},{"$f":"IF(AO118>0,\"X\",\"\")","v":""},null,{"$f":"COUNTIF(Y110:AA114,\"X\")","v":0}]
[{"$f":"Sprachen!L84","v":"Bestätigung Organisation"}]
[{"$f":"Sprachen!L234","v":"Name"},{"$nulls":7},{"$f":"IF('Selbstb. Produkt '!I28<>\"\",'Selbstb. Produkt '!I28,\"\")","v":""},{"$nulls":12},{"$f":"Sprachen!L61","v":"Bemerkung"}]
[{"$f":"Sprachen!L20","v":"Abteilung"},{"$nulls":7},{"$f":"IF('Selbstb. Produkt '!I29<>\"\",'Selbstb. Produkt '!I29,\"\")","v":""}]
[{"$f":"Sprachen!L343","v":"Telefon"},{"$nulls":7},{"$f":"IF('Selbstb. Produkt '!I30<>\"\",'Selbstb. Produkt '!I30,\"\")","v":""}]
[{"$f":"Sprachen!L119","v":"E-Mail/Fax-Nr."},{"$nulls":7},{"$f":"IF('Selbstb. Produkt '!I31<>\"\",'Selbstb. Produkt '!I31,\"\")","v":""}]
[{"$f":"Sprachen!L91","v":"Datum"},{"$nulls":20},{"$f":"Sprachen!L348","v":"Unterschrift"}]
[{"$f":"Sprachen!L124","v":"Entscheidung Kunde"}]
[{"$f":"Sprachen!L191","v":"Kundentauglich/Serientauglich"},{"$nulls":19},{"$f":"Sprachen!L243","v":"Nicht kundentauglich/\n Nicht serientauglich"}]
[{"$f":"Sprachen!L268","v":"PPF-Verfahren zum Kunden abgeschlossen"},{"$nulls":19},{"$f":"Sprachen!L238","v":"Neues PPF-Verfahren erforderlich"},{"$nulls":19},{"$f":"COUNTIF(S127:T128,\"X\")+COUNTIF(AM127,\"X\")","v":0}]
[{"$f":"Sprachen!L25","v":"Aktualisierte PPF-Dokumentation erforderlich"}]
[{"$f":"Sprachen!L21","v":"Abweichende Einschätzung des Kunden gegenüber der Organisation"}]
[{"$f":"Sprachen!L219","v":"Nachforderung \nVorzulegende Dokumente zu offenen Prüfgebieten"},{"$nulls":9},{"$f":"Sprachen!L289","v":"Prüfgebiet"},{"$nulls":4},{"$f":"Sprachen!L220","v":"Nachforderung/Begründung"}]
[]
[]
[]
[]
[{"$f":"Sprachen!L29","v":"Akzeptanz von Abweichungen \n(ohne Anpassung weiterer Dokumente)"},{"$nulls":9},{"$f":"Sprachen!L289","v":"Prüfgebiet"},{"$nulls":4},{"$f":"Sprachen!L237","v":"Neue Spezifikation"}]
[]
[]
[]
[]
[{"$f":"Sprachen!L23","v":"Abweich-          genehmigung"},{"$nulls":9},{"$f":"Sprachen!L289","v":"Prüfgebiet"},{"$nulls":4},{"$f":"Sprachen!L22","v":"Abweichgenehmigung"},{"$nulls":19},{"$f":"Sprachen!L160","v":"Gültigkeit"}]
[]
[]
[]
[]
[{"$f":"Sprachen!L234","v":"Name"},{"$nulls":7},{"$f":"IF('PPF Abstimmung'!I270<>\"\",'PPF Abstimmung'!I270,\"\")","v":""},{"$nulls":12},{"$f":"Sprachen!L61","v":"Bemerkung"}]
[{"$f":"Sprachen!L20","v":"Abteilung"},{"$nulls":7},{"$f":"IF('PPF Abstimmung'!I271<>\"\",'PPF Abstimmung'!I271,\"\")","v":""}]
[{"$f":"Sprachen!L343","v":"Telefon"},{"$nulls":7},{"$f":"IF('PPF Abstimmung'!I272<>\"\",'PPF Abstimmung'!I272,\"\")","v":""}]
[{"$f":"Sprachen!L119","v":"E-Mail/Fax-Nr."},{"$nulls":7},{"$f":"IF('PPF Abstimmung'!I273<>\"\",'PPF Abstimmung'!I273,\"\")","v":""}]
[{"$f":"Sprachen!L91","v":"Datum"},{"$nulls":20},{"$f":"Sprachen!L348","v":"Unterschrift"}]

{"sheet":"Prozessbez. Nachweise","index":3,"n_rows":44,"n_cols":42,"rows_kept":44,"merged":[[0,0,1,12],[0,13,0,19],[0,20,0,27],[0,28,0,30],[0,31,0,33],[0,34,0,36],[0,37,0,39],[0,44,0,49],[1,13,1,19],[1,20,1,39],[2,0,2,13],[2,14,2,26],[2,27,2,39],[3,0,3,6],[3,7,3,13],[3,14,3,20],[3,21,3,26],[3,27,4,33],[3,34,4,39],[4,0,4,6],[4,7,4,13],[4,14,4,20],[4,21,4,26],[5,0,5,6],[5,7,5,13],[5,14,5,20],[5,21,5,26],[5,27,5,33],[5,34,5,39],[6,0,6,6],[6,7,6,13],[6,14,6,20],[6,21,6,26],[6,27,6,33],[6,34,6,39],[7,0,7,6],[7,7,7,13],[7,14,7,20],[7,21,7,26],[7,27,7,33],[7,34,7,39],[8,0,8,6],[8,7,8,13],[8,14,8,20],[8,21,8,26],[8,27,8,33],[8,34,8,39],[9,0,9,6],[9,7,9,13],[9,14,9,20],[9,21,9,26],[9,27,9,33],[9,34,9,39],[10,0,10,6],[10,7,10,13],[10,14,10,20],[10,21,10,26],[10,27,10,33],[10,34,10,39],[11,0,11,13],[12,0,12,2],[12,3,12,4],[12,5,12,13],[12,14,12,15],[12,16,12,17],[12,18,12,26],[12,27,12,28],[12,29,12,30],[12,31,12,39],[13,0,13,2],[13,3,13,4],[13,5,13,13],[13,14,13,15],[13,16,13,17],[13,18,13,26],[13,27,13,28],[13,29,13,30],[13,31,13,39],[14,0,14,2],[14,3,14,4],[14,5,14,13],[14,14,14,15],[14,16,14,17],[14,18,14,26],[14,27,14,28],[14,29,14,30],[14,31,14,39],[15,0,15,2],[15,3,15,4],[15,5,15,13],[15,14,15,15],[15,16,15,17],[15,18,15,26],[15,27,15,28],[15,29,15,30],[15,31,15,39],[16,0,16,2],[16,3,16,4],[16,5,16,13],[16,14,16,15],[16,16,16,17],[16,18,16,26],[16,27,16,28],[16,29,16,30],[16,31,16,39],[17,0,17,2],[17,3,17,4],[17,5,17,13],[17,14,17,15],[17,16,17,17],[17,18,17,26],[17,27,17,28],[17,29,17,30],[17,31,17,39],[18,0,19,2],[18,3,19,10],[18,11,18,29],[18,30,19,39],[19,11,19,22],[19,23,19,25],[19,26,19,29],[20,0,20,2],[20,3,20,10],[20,11,20,22],[20,23,20,25],[20,26,20,29],[20,30,20,39],[21,0,21,2],[21,3,21,10],[21,11,21,22],[21,23,21,25],[21,26,21,29],[21,30,21,39],[22,0,22,2],[22,3,22,10],[22,11,22,22],[22,23,22,25],[22,26,22,29],[22,30,22,39],[23,0,23,2],[23,3,23,10],[23,11,23,22],[23,23,23,25],[23,26,23,29],[23,30,23,39],[24,0,24,2],[24,3,24,10],[24,11,24,22],[24,23,24,25],[24,26,24,29],[24,30,24,39],[25,0,25,2],[25,3,25,10],[25,11,25,22],[25,23,25,25],[25,26,25,29],[25,30,25,39],[26,0,26,2],[26,3,26,10],[26,11,26,22],[26,23,26,25],[26,26,26,29],[26,30,26,39],[27,0,27,2],[27,3,27,10],[27,11,27,22],[27,23,27,25],[27,26,27,29],[27,30,27,39],[28,0,28,2],[28,3,28,10],[28,11,28,22],[28,23,28,25],[28,26,28,29],[28,30,28,39],[29,0,29,2],[29,3,29,10],[29,11,29,22],[29,23,29,25],[29,26,29,29],[29,30,29,39],[30,0,30,2],[30,3,30,10],[30,11,30,22],[30,23,30,25],[30,26,30,29],[30,30,30,39],[31,0,31,2],[31,3,31,10],[31,11,31,22],[31,23,31,25],[31,26,31,29],[31,30,31,39],[32,0,32,2],[32,3,32,10],[32,11,32,22],[32,23,32,25],[32,26,32,29],[32,30,32,39],[33,0,33,2],[33,3,33,10],[33,11,33,22],[33,23,33,25],[33,26,33,29],[33,30,33,39],[34,0,34,2],[34,3,34,10],[34,11,34,22],[34,23,34,25],[34,26,34,29],[34,30,34,39],[35,0,35,2],[35,3,35,10],[35,11,35,22],[35,23,35,25],[35,26,35,29],[35,30,35,39],[36,0,36,2],[36,3,36,10],[36,11,36,22],[36,23,36,25],[36,26,36,29],[36,30,36,39],[37,0,37,2],[37,3,37,10],[37,11,37,22],[37,23,37,25],[37,26,37,29],[37,30,37,39],[38,0,38,39],[39,0,39,7],[39,8,39,20],[39,21,42,25],[39,26,42,39],[40,0,40,7],[40,8,40,20],[41,0,41,7],[41,8,41,20],[42,0,42,7],[42,8,42,20],[43,0,43,7],[43,8,43,20],[43,21,43,25],[43,26,43,39]]}
[{"$f":"Sprachen!L286","v":"Produktionsprozess-bezogene und generelle Nachweise"},{"$nulls":12},{"$f":"Sprachen!L378","v":"Bericht"},{"$nulls":6},{"$f":"IF(H4<>\"\",H4&\" / \"&H5,\"\")","v":""},{"$nulls":7},{"$f":"Sprachen!L88","v":"Blatt"},{"$nulls":5},{"$f":"Sprachen!L364","v":"von"},{"$nulls":6},"Sprachauswahl"]
[{"$nulls":13},{"$f":"Sprachen!L255","v":"Organisation"},{"$nulls":6},{"$f":"IF('Deckblatt '!U2<>\"\",'Deckblatt '!U2,\"\")","v":""},{"$nulls":20},{"$f":"'PPF-Bewertung'!AP3","v":"Deutsch"}]
[{"$f":"Sprachen!L46","v":"Angaben zur Organisation"},{"$nulls":13},{"$f":"Sprachen!L44","v":"Angaben zu Mustern"},{"$nulls":12},{"$f":"Sprachen!L45","v":"Angaben zum Kunden"}]
[{"$f":"Sprachen!L75","v":"Berichtsnummer"},{"$nulls":6},{"$f":"IF('Deckblatt '!H16<>\"\",'Deckblatt '!H16,\"\")","v":""},{"$nulls":6},{"$f":"Sprachen!L198","v":"Lieferscheinnummer"},{"$nulls":6},{"$f":"IF('Deckblatt '!V16<>\"\",'Deckblatt '!V16,\"\")","v":""},{"$nulls":5},{"$f":"Sprachen!L187","v":"Kunde"},{"$nulls":6},{"$f":"IF('Deckblatt '!A10<>\"\",'Deckblatt '!A10,\"\")","v":""}]
[{"$f":"Sprachen!L77","v":"Berichtsversion"},{"$nulls":6},{"$f":"IF('Deckblatt '!H17<>\"\",'Deckblatt '!H17,\"\")","v":""},{"$nulls":6},{"$f":"Sprachen!L197","v":"Liefermenge"},{"$nulls":6},{"$f":"IF('Deckblatt '!V17<>\"\",'Deckblatt '!V17,\"\")","v":""}]
[{"$f":"Sprachen!L199","v":"Lieferstandort"},{"$nulls":6},{"$f":"IF('Deckblatt '!H18<>\"\",'Deckblatt '!H18,\"\")","v":""},{"$nulls":6},{"$f":"Sprachen!L89","v":"Chargennummer"},{"$nulls":6},{"$f":"IF('Deckblatt '!V18<>\"\",'Deckblatt '!V18,\"\")","v":""},{"$nulls":5},{"$f":"Sprachen!L87","v":"Bestellnr. PPF-Muster"},{"$nulls":6},{"$f":"IF('Deckblatt '!AI18<>\"\",'Deckblatt '!AI18,\"\")","v":""}]
[{"$f":"Sprachen!L276","v":"Produktionsstandort"},{"$nulls":6},{"$f":"IF('Deckblatt '!H19<>\"\",'Deckblatt '!H19,\"\")","v":""},{"$nulls":6},{"$f":"Sprachen!L217","v":"Mustergewicht [kg]"},{"$nulls":6},{"$f":"IF('Deckblatt '!V19<>\"\",'Deckblatt '!V19,\"\")","v":""},{"$nulls":5},{"$f":"Sprachen!L14","v":"Abladestelle"},{"$nulls":6},{"$f":"IF('Deckblatt '!AI19<>\"\",'Deckblatt '!AI19,\"\")","v":""}]
[{"$f":"Sprachen!L304","v":"Sachnummer"},{"$nulls":6},{"$f":"IF('Deckblatt '!H20<>\"\",'Deckblatt '!H20,\"\")","v":""},{"$nulls":6},{"$f":"Sprachen!L166","v":"Hardwarestand"},{"$nulls":6},{"$f":"IF('Deckblatt '!V20<>\"\",'Deckblatt '!V20,\"\")","v":""},{"$nulls":5},{"$f":"Sprachen!L304","v":"Sachnummer"},{"$nulls":6},{"$f":"IF('Deckblatt '!AI20<>\"\",'Deckblatt '!AI20,\"\")","v":""}]
[{"$f":"Sprachen!L65","v":"Benennung"},{"$nulls":6},{"$f":"IF('Deckblatt '!H21<>\"\",'Deckblatt '!H21,\"\")","v":""},{"$nulls":6},{"$f":"Sprachen!L98","v":"Diagnosestand"},{"$nulls":6},{"$f":"IF('Deckblatt '!V21<>\"\",'Deckblatt '!V21,\"\")","v":""},{"$nulls":5},{"$f":"Sprachen!L65","v":"Benennung"},{"$nulls":6},{"$f":"IF('Deckblatt '!AI21<>\"\",'Deckblatt '!AI21,\"\")","v":""}]
[{"$f":"Sprachen!L374","v":"Zeichnungsnummer"},{"$nulls":6},{"$f":"IF('Deckblatt '!H22<>\"\",'Deckblatt '!H22,\"\")","v":""},{"$nulls":6},{"$f":"Sprachen!L326","v":"Softwarestand"},{"$nulls":6},{"$f":"IF('Deckblatt '!V22<>\"\",'Deckblatt '!V22,\"\")","v":""},{"$nulls":5},{"$f":"Sprachen!L374","v":"Zeichnungsnummer"},{"$nulls":6},{"$f":"IF('Deckblatt '!AI22<>\"\",'Deckblatt '!AI22,\"\")","v":""}]
[{"$f":"Sprachen!L361","v":"Version/ Datum"},{"$nulls":6},{"$f":"IF('Deckblatt '!H23<>\"\",'Deckblatt '!H23,\"\")","v":""},{"$nulls":6},{"$f":"Sprachen!L177","v":"Kennung/DUNS"},{"$nulls":6},{"$f":"IF('Deckblatt '!V23<>\"\",'Deckblatt '!V23,\"\")","v":""},{"$nulls":5},{"$f":"Sprachen!L361","v":"Version/ Datum"},{"$nulls":6},{"$f":"IF('Deckblatt '!AI23<>\"\",'Deckblatt '!AI23,\"\")","v":""}]
[{"$f":"IF('Deckblatt '!A24:N24<>\"\",'Deckblatt '!A24:N24,\"\")","v":"-"}]
[{"$f":"IF('PPF-Bewertung'!M25=\"ja\",\"x\",IF('PPF-Bewertung'!M25=\"yes\",\"x\",\"\"))","v":""},null,null,"2.1",null,{"$f":"Sprachen!L283","v":"Prozessablaufdiagramm"},{"$nulls":8},{"$f":"IF('PPF-Bewertung'!M46=\"ja\",\"x\",IF('PPF-Bewertung'!M46=\"yes\",\"x\",\"\"))","v":""},null,"4.4",null,{"$f":"Sprachen!L300","v":"Referenzmuster"},{"$nulls":8},{"$f":"IF('PPF-Bewertung'!M53=\"ja\",\"x\",IF('PPF-Bewertung'!M53=\"yes\",\"x\",\"\"))","v":""},null,"5.4","5.4",{"$f":"Sprachen!L291","v":"Prüfmittelfähigkeitsnachweis Produkt u. Produktionsprozess"}]
[{"$f":"IF('PPF-Bewertung'!M26=\"ja\",\"x\",IF('PPF-Bewertung'!M26=\"yes\",\"x\",\"\"))","v":""},null,null,"2.2",null,{"$f":"Sprachen!L287","v":"Prozess-FMEA"},{"$nulls":8},{"$f":"IF('PPF-Bewertung'!M47=\"ja\",\"x\",IF('PPF-Bewertung'!M47=\"yes\",\"x\",\"\"))","v":""},null,"4.5",null,{"$f":"Sprachen!L274","v":"Produktionskapazität"},{"$nulls":8},{"$f":"IF('PPF-Bewertung'!M54=\"ja\",\"x\",IF('PPF-Bewertung'!M54=\"yes\",\"x\",\"\"))","v":""},null,"5.5","5.5",{"$f":"Sprachen!L341","v":"Teilelebenslauf"}]
[{"$f":"IF('PPF-Bewertung'!M27=\"ja\",\"x\",IF('PPF-Bewertung'!M27=\"yes\",\"x\",\"\"))","v":""},null,null,"2.3",null,{"$f":"Sprachen!L275","v":"Produktionslenkungsplan"},{"$nulls":8},{"$f":"IF('PPF-Bewertung'!M48=\"ja\",\"x\",IF('PPF-Bewertung'!M48=\"yes\",\"x\",\"\"))","v":""},null,"4.6",null,{"$f":"Sprachen!L371","v":"Werkzeuge"},{"$nulls":8},{"$f":"IF('PPF-Bewertung'!M55=\"ja\",\"x\",IF('PPF-Bewertung'!M55=\"yes\",\"x\",\"\"))","v":""},null,"5.6","5.6",{"$f":"Sprachen!L113","v":"Eignungsnachweis der eingesetzten Ladungsträger inkl. Lagerung"}]
[{"$f":"IF('PPF-Bewertung'!M43=\"ja\",\"x\",IF('PPF-Bewertung'!M43=\"yes\",\"x\",\"\"))","v":""},null,null,"4.1",null,{"$f":"Sprachen!L16","v":"Absicherung Besonderer Merkmale gemäß technischen Spezifikationen und vereinbarten Merkmalen (z. B. Poka Yoke, 100%-Prüfung, Prozessfähigkeiten, …)"},{"$nulls":8},{"$f":"IF('PPF-Bewertung'!M50=\"ja\",\"x\",IF('PPF-Bewertung'!M50=\"yes\",\"x\",\"\"))","v":""},null,"5.1",null,{"$f":"Sprachen!L226","v":"Nachweise zur Einhaltung gesetzlicher Anforderungen "},{"$nulls":8},{"$f":"IF('PPF-Bewertung'!M56=\"ja\",\"x\",IF('PPF-Bewertung'!M56=\"yes\",\"x\",\"\"))","v":""},null,"5.7","5.7",{"$f":"Sprachen!L107","v":"Dokumentation der Vereinbarungen zum Befundungs- und Analyseprozess\n- Reklamationsbearbeitung (z.B. 8D)\n- Schadteilanalyse Feld"}]
[{"$f":"IF('PPF-Bewertung'!M44=\"ja\",\"x\",IF('PPF-Bewertung'!M44=\"yes\",\"x\",\"\"))","v":""},null,null,"4.2",null,{"$f":"Sprachen!L194","v":"Laborqualifizierung"},{"$nulls":8},{"$f":"IF('PPF-Bewertung'!M51=\"ja\",\"x\",IF('PPF-Bewertung'!M51=\"yes\",\"x\",\"\"))","v":""},null,"5.2",null,{"$f":"Sprachen!L264","v":"PPF-Status Lieferkette"},{"$nulls":8},{"$f":"IF('PPF-Bewertung'!M57=\"ja\",\"x\",IF('PPF-Bewertung'!M57=\"yes\",\"x\",\"\"))","v":""},null,"5.8","5.8",{"$f":"Sprachen!L106","v":"Dokumentation der Vereinbarung zur Requalifikation"}]
[{"$f":"IF('PPF-Bewertung'!M45=\"ja\",\"x\",IF('PPF-Bewertung'!M45=\"yes\",\"x\",\"\"))","v":""},null,null,"4.3",null,{"$f":"Sprachen!L216","v":"Muster inkl. Fertigungsdokumentation"},{"$nulls":8},{"$f":"IF('PPF-Bewertung'!M52=\"ja\",\"x\",IF('PPF-Bewertung'!M52=\"yes\",\"x\",\"\"))","v":""},null,"5.3",null,{"$f":"Sprachen!L292","v":"Prüfmittelliste Produkt und Produktionsprozess"},{"$nulls":8},{"$f":"IF('PPF-Bewertung'!M58=\"ja\",\"x\",IF('PPF-Bewertung'!M58=\"yes\",\"x\",\"\"))","v":""},null,"5.9","5.9",{"$f":"Sprachen!L327","v":"Sonstiges"}]
[{"$f":"Sprachen!L248","v":"Nr."},null,null,{"$f":"Sprachen!L39","v":"Anforderung"},{"$nulls":7},{"$f":"Sprachen!L224","v":"Nachweis-      \ndokument"},{"$nulls":18},{"$f":"Sprachen!L61","v":"Bemerkung"}]
[{"$nulls":11},{"$f":"Sprachen!L104","v":"Dokument"},{"$nulls":11},{"$f":"Sprachen!L360","v":"Version"},null,null,{"$f":"Sprachen!L91","v":"Datum"}]
[1]
[2]
[3]
[4]
[5]
[6]
[7]
[8]
[9]
[10]
[11]
[12]
[13]
[14]
[15]
[16]
[17]
[18]
[{"$f":"Sprachen!L84","v":"Bestätigung Organisation"}]
[{"$f":"Sprachen!L234","v":"Name"},{"$nulls":20},{"$f":"Sprachen!L61","v":"Bemerkung"}]
[{"$f":"Sprachen!L20","v":"Abteilung"}]
[{"$f":"Sprachen!L343","v":"Telefon"}]
[{"$f":"Sprachen!L119","v":"E-Mail/Fax-Nr."}]
[{"$f":"Sprachen!L91","v":"Datum"},{"$nulls":20},{"$f":"Sprachen!L348","v":"Unterschrift"}]

{"sheet":"Sprachen","index":4,"n_rows":845,"n_cols":12,"rows_kept":845,"hidden":true}
[1,2,3,4,5,6,7,8,9,10,null,{"$f":"'PPF Abstimmung'!AS2","v":1}]
["Deutsch","English",{"$nulls":9},{"$f":"VLOOKUP(A2,A:J,$L$1,FALSE)","v":"Deutsch"}]
[]
["Ja","Yes",{"$nulls":9},{"$f":"VLOOKUP(A4,A:J,$L$1,FALSE)","v":"Ja"}]
["Nein","No",{"$nulls":9},"Nein"]
["Anforderungen erfüllt","Requirements met",{"$nulls":9},"Anforderungen erfüllt"]
["Anforderungen nicht vollständig erfüllt","Requirements not fully met",{"$nulls":9},"Anforderungen nicht vollständig erfüllt"]
["Anforderungen nicht erfüllt","Requirements not met",{"$nulls":9},"Anforderungen nicht erfüllt"]
["Eingabe nicht korrekt, bitte prüfen","Entry incorrect, please check",{"$nulls":9},"Eingabe nicht korrekt, bitte prüfen"]
["Adresse","Address",{"$nulls":9},"Adresse"]
["Abweichung zur Spezifikation,\nKundenakzeptanz liegt vor ","Deviation from specification\ncustomer acceptance granted ",{"$nulls":9},"Abweichung zur Spezifikation,\nKundenakzeptanz liegt vor "]
["(sofern für das Produkt zutreffend)","(if applicable for the product)",{"$nulls":9},"(sofern für das Produkt zutreffend)"]
["3D-Datensatzmessung","3D record measurement",{"$nulls":9},"3D-Datensatzmessung"]
["Abladestelle","Unloading point",{"$nulls":9},"Abladestelle"]
["Abnahmerichtlinien","Acceptance guidelines",{"$nulls":9},"Abnahmerichtlinien"]
["Absicherung Besonderer Merkmale gemäß technischen Spezifikationen und vereinbarten Merkmalen (z. B. Poka Yoke, 100%-Prüfung, Prozessfähigkeiten, …)","Assurance of special characteristics according to technical specifications and agreed characteristics (e.g. poka-yoke, 100% inspection, process capabilities, etc.)",{"$nulls":9},"Absicherung Besonderer Merkmale gemäß technischen Spezifikationen und vereinbarten Merkmalen (z. B. Poka Yoke, 100%-Prüfung, Prozessfähigkeiten, …)"]
["Absicherung nicht vollständig nachgewiesen ","Assurance not fully verified ",{"$nulls":9},"Absicherung nicht vollständig nachgewiesen "]
["Absicherung nicht vollständig nachgewiesen, \nZusatzmaßnahmen sind installiert,\nKundenakzeptanz liegt vor","Assurance not fully verified\nadditional measures installed\ncustomer acceptance granted",{"$nulls":9},"Absicherung nicht vollständig nachgewiesen, \nZusatzmaßnahmen sind installiert,\nKundenakzeptanz liegt vor"]
["Abstimmung PPF-Inhalt und Vorlage","Agreement on PPA content and submission",{"$nulls":9},"Abstimmung PPF-Inhalt und Vorlage"]
["Abteilung","Department",{"$nulls":9},"Abteilung"]
["Abweichende Einschätzung des Kunden gegenüber der Organisation","Customer evaluation deviating from that of the organization",{"$nulls":9},"Abweichende Einschätzung des Kunden gegenüber der Organisation"]
["Abweichgenehmigung","Deviation approval",{"$nulls":9},"Abweichgenehmigung"]
["Abweich-          genehmigung","Deviation approval",{"$nulls":9},"Abweich-          genehmigung"]
["Aktualisierte PPF-Dokumentation","Updated PPA documentation",{"$nulls":9},"Aktualisierte PPF-Dokumentation"]
["Aktualisierte PPF-Dokumentation erforderlich","Updated PPA documentation required",{"$nulls":9},"Aktualisierte PPF-Dokumentation erforderlich"]
["Aktualisierung der PPF-Dokumentation erforderlich","Update of PPA documentation required",{"$nulls":9},"Aktualisierung der PPF-Dokumentation erforderlich"]
["Akustik","Acoustics",{"$nulls":9},"Akustik"]
["Akustikprüfung","Acoustic",{"$nulls":9},"Akustikprüfung"]
["Akzeptanz von Abweichungen \n(ohne Anpassung weiterer Dokumente)","Acceptance of deviations\n(without adjusting other documents)",{"$nulls":9},"Akzeptanz von Abweichungen \n(ohne Anpassung weiterer Dokumente)"]
["Alle Produktionseinrichtungen  \nabgenommen (2)","All production facilities\naccepted *2",{"$nulls":9},"Alle Produktionseinrichtungen  \nabgenommen (2)"]
["PPF-Deckblatt / PPF-Bewertung / Selbstbeurteilung","PPA cover sheet / PPA evaluation / Self-Assessment",{"$nulls":9},"PPF-Deckblatt / PPF-Bewertung / Selbstbeurteilung"]
["Änd.-Stand Kunde","Version, customer",{"$nulls":9},"Änd.-Stand Kunde"]
["Änd.-Stand Organisation","Version, organization",{"$nulls":9},"Änd.-Stand Organisation"]
["Änd.-Nummer Kunde","Change number customer",{"$nulls":9},"Änd.-Nummer Kunde"]
["Änderung in der Lieferkette","Change to supply chain",{"$nulls":9},"Änderung in der Lieferkette"]
["Änderungen am Produkt","Changes to product",{"$nulls":9},"Änderungen am Produkt"]
["Änderungen am Produktionsprozess","Changes to production process",{"$nulls":9},"Änderungen am Produktionsprozess"]
["Änderungsbeschreibung","Description of change",{"$nulls":9},"Änderungsbeschreibung"]
["Anforderung","Requirement",{"$nulls":9},"Anforderung"]
["Anforderung vorhanden","Requirement existing",{"$nulls":9},"Anforderung vorhanden"]
["Anforderungen/\nSpezifikation","Requirements/\nSpecification",{"$nulls":9},"Anforderungen/\nSpezifikation"]
["Anforderungen nicht vollständig erfüllt","Requirements not fully met",{"$nulls":9},"Anforderungen nicht vollständig erfüllt"]
["Anforderungen vollständig erfüllt","Requirements fully met",{"$nulls":9},"Anforderungen vollständig erfüllt"]
["Angaben zu Mustern","Information about samples",{"$nulls":9},"Angaben zu Mustern"]
["Angaben zum Kunden","Information about the customer",{"$nulls":9},"Angaben zum Kunden"]
["Angaben zur Organisation","Information about the organization",{"$nulls":9},"Angaben zur Organisation"]
["Ansprechpartner","Contact person",{"$nulls":9},"Ansprechpartner"]
["Ansprechpartner Kunde","Customer contact",{"$nulls":9},"Ansprechpartner Kunde"]
["Anwendung","Application",{"$nulls":9},"Anwendung"]
["Anwen-dung","Application",{"$nulls":9},"Anwen-dung"]
["Anzahl Musterteile","Number of sample parts",{"$nulls":9},"Anzahl Musterteile"]
["Anzahl Teile pro Nest/Form","Number of parts per cavity/mold",{"$nulls":9},"Anzahl Teile pro Nest/Form"]
["Ausfüllhilfen:","Instruction how to fill in the form:",{"$nulls":9},"Ausfüllhilfen:"]
["Ausgabe/ Stand/Datum","Issue/ Status/Date",{"$nulls":9},"Ausgabe/ Stand/Datum"]
["Auslöser PPF-Verfahren","Trigger of PPA procedure",{"$nulls":9},"Auslöser PPF-Verfahren"]
["Aussehen","Appearance",{"$nulls":9},"Aussehen"]
["PPF-Verfahren","PPA procedure",{"$nulls":9},"PPF-Verfahren"]
["PPF-Verfahren","PPA procedure",{"$nulls":9},"PPF-Verfahren"]
["Bauteilinformationen","Component information",{"$nulls":9},"Bauteilinformationen"]
["Begründung des gestuften PPF-Verfahrens","Reason for stepped PPA procedure",{"$nulls":9},"Begründung des gestuften PPF-Verfahrens"]
["Bemerkung","Remark",{"$nulls":9},"Bemerkung"]
["Bemerkung/Beschreibung","Remark/Description",{"$nulls":9},"Bemerkung/Beschreibung"]
["Bemerkung/Maßnahmen + Termin \n(sofern nicht OK ausgewählt) (5)","Remark/actions + date\n(if not OK selected) (5)",{"$nulls":9},"Bemerkung/Maßnahmen + Termin \n(sofern nicht OK ausgewählt) (5)"]
["PPF-Verantwortlicher (optional)","Sampling representative (optional)",{"$nulls":9},"PPF-Verantwortlicher (optional)"]
["Benennung","Name",{"$nulls":9},"Benennung"]
["Benennung Kunde","Part name customer",{"$nulls":9},"Benennung Kunde"]
["Benennung Organisation","Part name organization",{"$nulls":9},"Benennung Organisation"]
["Bereitstellung IMDS","IMDS provision",{"$nulls":9},{"$f":"VLOOKUP(A68,A:J,$L$1,FALSE)","v":"Bereitstellung IMDS"}]
["Bereitstellungsdauer","Duration of provision",{"$nulls":9},"Bereitstellungsdauer"]
["Bereitstellungs-termin","Date of provision",{"$nulls":9},"Bereitstellungs-termin"]
["Bericht Produktionsprozess- und Produktfreigabe (PPF)","Report on production process and product approval (PPA)",{"$nulls":9},"Bericht Produktionsprozess- und Produktfreigabe (PPF)"]
["Bericht sonstige Muster","Report on other samples",{"$nulls":9},"Bericht sonstige Muster"]
["Bauteil mit besonderer Archivierungspflicht","Part with special archiving requirement",{"$nulls":9},"Bauteil mit besonderer Archivierungspflicht"]
["-","-",{"$nulls":9},"-"]
["Berichtsnummer","Report number",{"$nulls":9},"Berichtsnummer"]
["Berichtsnummer/-version","Report number/version",{"$nulls":9},"Berichtsnummer/-version"]
["Berichtsversion","Report version",{"$nulls":9},"Berichtsversion"]
["Berücksichtigung im Rahmen des PPF-Verfahrens","Consideration in the scope of the PPA procedure",{"$nulls":9},"Berücksichtigung im Rahmen des PPF-Verfahrens"]
["Beschreibung","Description",{"$nulls":9},"Beschreibung"]
["Besondere Merkmale (Sicherheit, Zulassung, Funktion)","Special Characteristics (safety, legal, function)",{"$nulls":9},"Besondere Merkmale (Sicherheit, Zulassung, Funktion)"]
["Besondere und vereinbarte Merkmale abgesichert","Special and agreed characteristics assured",{"$nulls":9},"Besondere und vereinbarte Merkmale abgesichert"]
["Beständigkeit gegenüber Electrostatic Discharge (ESD) ","Resistance to electrostatic discharge (ESD) ",{"$nulls":9},"Beständigkeit gegenüber Electrostatic Discharge (ESD) "]
["Bestätigung Kunde","Confirmation of customer",{"$nulls":9},"Bestätigung Kunde"]
["Bestätigung Organisation","Confirmation of organization",{"$nulls":9},"Bestätigung Organisation"]
["Hiermit wird bestätigt, dass das PPF-Verfahren entsprechend den Vereinbarungen der Abstimmung zum PPF-Verfahren und nach den Vorgaben gemäß VDA Band 2 durchgeführt wurde.","It is hereby confirmed that the PPA procedure was carried out in accordance with the agreements made in the PPA agreement and the specifications of VDA Volume 2.",{"$nulls":9},"Hiermit wird bestätigt, dass das PPF-Verfahren entsprechend den Vereinbarungen der Abstimmung zum PPF-Verfahren und nach den Vorgaben gemäß VDA Band 2 durchgeführt wurde."]
["Bestätigung Organisation:","Confirmation of organization:",{"$nulls":9},"Bestätigung Organisation:"]
["Bestellnr. PPF-Muster","Order Number\nPPA samples",{"$nulls":9},"Bestellnr. PPF-Muster"]
["Blatt","Sheet",{"$nulls":9},"Blatt"]
["Chargennummer","Batch number",{"$nulls":9},"Chargennummer"]
["Chemische Analysen","Chemical analyses",{"$nulls":9},"Chemische Analysen"]
["Datum","Date",{"$nulls":9},"Datum"]
["Dauer in Arbeitstagen","Duration in working days",{"$nulls":9},"Dauer in Arbeitstagen"]
["Deckblatt zum \nPPF-Bericht","Cover sheet PPA report",{"$nulls":9},"Deckblatt zum \nPPF-Bericht"]
["PPF-Deckblatt/PPF-Bewertung","PPA cover sheet/evaluation",{"$nulls":9},"PPF-Deckblatt/PPF-Bewertung"]
["Der IMDS-Datensatz wurde erstellt unter der MDB-ID-Nr.:","The IMDS record was created under the MDS ID No.:",{"$nulls":9},"Der IMDS-Datensatz wurde erstellt unter der MDB-ID-Nr.:"]
["Der Kunde verzichtet auf die Vorlage von Dokumenten. \nDurchführung und Dokumentation des PPF-Verfahrens erfolgen ausschließlich innerhalb der Organisation.\nDer Kunde schließt sich der Freigabeempfehlung der Organisation an.","The customer waives the submission of documents. \nThe implementation and documentation of the PPA procedure take place exclusively within the organization.\nThe customer follows the approval recommendation of the organization.",{"$nulls":9},"Der Kunde verzichtet auf die Vorlage von Dokumenten. \nDurchführung und Dokumentation des PPF-Verfahrens erfolgen ausschließlich innerhalb der Organisation.\nDer Kunde schließt sich der Freigabeempfehlung der Organisation an."]
["Design-FMEA","Design FMEA",{"$nulls":9},"Design-FMEA"]
["Diagnosestand","Diagnosis status",{"$nulls":9},"Diagnosestand"]
["Die vorgestellten Muster wurden bezüglich der nachzuweisenden Merkmale mit serienmäßigen Betriebsmitteln unter serienmäßigen","With regards to the features to be verified, the samples presented were produced with serial equipment under serial conditions, ",{"$nulls":9},"Die vorgestellten Muster wurden bezüglich der nachzuweisenden Merkmale mit serienmäßigen Betriebsmitteln unter serienmäßigen"]
["Bedingungen am Serienstandort hergestellt bzw. bei „sonstigen Mustern“ gemäß Vereinbarung zwischen Organisation und Kunde"," at the series production location or, for “other samples”, according to the agreement between the organization and the customer",{"$nulls":9},"Bedingungen am Serienstandort hergestellt bzw. bei „sonstigen Mustern“ gemäß Vereinbarung zwischen Organisation und Kunde"]
["(als Anlage beigefügt). Bezüglich dieser Merkmale sind keine Änderungen bekannt bzw. geplant. Die bei unseren Prüfungen und"," (agreement to be attached). No changes are known or planned regarding these features. The results obtained in our tests",{"$nulls":9},"(als Anlage beigefügt). Bezüglich dieser Merkmale sind keine Änderungen bekannt bzw. geplant. Die bei unseren Prüfungen und"]
["der Freigabe erzielten Ergebnisse können für eine aktualisierte PPF-Dokumentation übernommen werden.  Sollten trotzdem Änderungen an"," can be re-used for an updated PPA documentation. Should changes to the part and/or production process still be necessary, ",{"$nulls":9},"der Freigabe erzielten Ergebnisse können für eine aktualisierte PPF-Dokumentation übernommen werden.  Sollten trotzdem Änderungen an"]
["Teil und/oder Produktionsprozess notwendig sein, werden wir dies bei der aktualisierten PPF-Dokumentation anzeigen.","we will indicate this in the updated PPA documentation.",{"$nulls":9},"Teil und/oder Produktionsprozess notwendig sein, werden wir dies bei der aktualisierten PPF-Dokumentation anzeigen."]
["Dokument","Document",{"$nulls":9},"Dokument"]
["Dokumentation der technischen SW-Spezifikationen","Documentation of technical SW specifications",{"$nulls":9},"Dokumentation der technischen SW-Spezifikationen"]
["Dokumentation der Vereinbarung zur Requalifikation","Documentation of the requalification agreement",{"$nulls":9},"Dokumentation der Vereinbarung zur Requalifikation"]
["Dokumentation der Vereinbarungen zum Befundungs- und Analyseprozess\n- Reklamationsbearbeitung (z.B. 8D)\n- Schadteilanalyse Feld","Documentation of agreements regarding the diagnosis and analysis process\n- Complaints handling (e.g. 8D)\n- Field failure analysis ",{"$nulls":9},"Dokumentation der Vereinbarungen zum Befundungs- und Analyseprozess\n- Reklamationsbearbeitung (z.B. 8D)\n- Schadteilanalyse Feld"]
["Dokumentation der während der gesamten Projektlaufzeit eingesetzten Entwicklungswerkzeuge","Documentation of development tools",{"$nulls":9},"Dokumentation der während der gesamten Projektlaufzeit eingesetzten Entwicklungswerkzeuge"]
["Dokumentation der während der gesamten Projektlaufzeit eingesetzten Testwerkzeuge","Documentation of testing tools ",{"$nulls":9},"Dokumentation der während der gesamten Projektlaufzeit eingesetzten Testwerkzeuge"]
["Dokumentation des Versionsmanagements (Baseline, Konfigurationen, Änderungshistorie)","Documentation of version management",{"$nulls":9},"Dokumentation des Versionsmanagements (Baseline, Konfigurationen, Änderungshistorie)"]
["Dokumentation über FOSS (Free-and-Open-Source-Software)","Documentation of FOSS (free and open-source software)",{"$nulls":9},"Dokumentation über FOSS (Free-and-Open-Source-Software)"]
["Dokumenten-nummer","Document number",{"$nulls":9},"Dokumenten-nummer"]
["Eignungsnachweis der eingesetzten Ladungsträger inkl. Lagerung","Evidence of suitability of the employed load carriers including storage",{"$nulls":9},"Eignungsnachweis der eingesetzten Ladungsträger inkl. Lagerung"]
["Einkauf (optional)","Purchasing (optional)",{"$nulls":9},"Einkauf (optional)"]
["Einzelbewertung durch die Organisation","Individual evaluation by organization",{"$nulls":9},"Einzelbewertung durch die Organisation"]
["Einzelteilmessung","Single part measurement",{"$nulls":9},"Einzelteilmessung"]
["Elektrische Sicherheit / Hochvolt-Sicherheit","Electrical safety / high-voltage safety",{"$nulls":9},"Elektrische Sicherheit / Hochvolt-Sicherheit"]
["Elektromagnetische Verträglichkeit (EMV)","Electromagnetic compatibility (EMC)",{"$nulls":9},"Elektromagnetische Verträglichkeit (EMV)"]
["E-Mail/Fax-Nr.","E-mail/Fax",{"$nulls":9},"E-Mail/Fax-Nr."]
["E-Mail/Fax-Nr.","E-mail/Fax",{"$nulls":9},"E-Mail/Fax-Nr."]
["Empfängerstandort","Recipient location",{"$nulls":9},"Empfängerstandort"]
["Empfehlung durch die Organisation","Recommendation by the organization",{"$nulls":9},"Empfehlung durch die Organisation"]
["Endtermin des PPF-Verfahrens","PPA procedure due date",{"$nulls":9},"Endtermin des PPF-Verfahrens"]
["Entscheidung Kunde","Customer decision",{"$nulls":9},"Entscheidung Kunde"]
["Entspricht nicht dem Serienstand,\nKundenakzeptanz liegt nicht vor","Does not correspond to series status customer acceptance not granted",{"$nulls":9},"Entspricht nicht dem Serienstand,\nKundenakzeptanz liegt nicht vor"]
["Entspricht nicht dem Serienstand, Kundenakzeptanz liegt vor ","Does not correspond to series status, customer acceptance granted ",{"$nulls":9},"Entspricht nicht dem Serienstand, Kundenakzeptanz liegt vor "]
["Entwicklung (optional)","Engineering (optional)",{"$nulls":9},"Entwicklung (optional)"]
["Erforderliches Personal verfügbar und geschult,\nArbeits- und Prüfanweisungen \nvollständig","Required personnel available and trained\nwork and test instructions\ncomplete",{"$nulls":9},"Erforderliches Personal verfügbar und geschult,\nArbeits- und Prüfanweisungen \nvollständig"]
["Ersteinsatz","First use",{"$nulls":9},"Ersteinsatz"]
["Erstlieferdatum","Date of first delivery",{"$nulls":9},"Erstlieferdatum"]
["Farbabhängige Eigenschaften","Color-dependent properties",{"$nulls":9},"Farbabhängige Eigenschaften"]
["Farbmessung und visuelle Eigenbeurteilung","Color measurement and visual self-assessment",{"$nulls":9},{"$f":"VLOOKUP(A132,A:J,$L$1,FALSE)","v":"Farbmessung und visuelle Eigenbeurteilung"}]
["Farbton","Color",{"$nulls":9},"Farbton"]
["Fertigung (optional)","Production (optional)",{"$nulls":9},"Fertigung (optional)"]
["Fertigung am Produktionsstandort \ndurch die Organisation abgenommen\n(Fertigungslayout umgesetzt, Verkettung Anlagen umgesetzt) ","Production at production location\napproved by the organization\n(Production layout set up, linking between production equipment realized)",{"$nulls":9},"Fertigung am Produktionsstandort \ndurch die Organisation abgenommen\n(Fertigungslayout umgesetzt, Verkettung Anlagen umgesetzt) "]
["Fertigung am Produktionsstandort \ndurch die Organisation noch nicht abgenommen; \nKeine Qualitäts-beeinträchtigungen \nin der Serie zu erwarten","Production at production location\nnot approved by the organization yet;\nNo negative quality impacts expected in series production",{"$nulls":9},"Fertigung am Produktionsstandort \ndurch die Organisation noch nicht abgenommen; \nKeine Qualitäts-beeinträchtigungen \nin der Serie zu erwarten"]
["Fertigung nicht am Produktionsstandort; \n \n\nQualitätsbeeinträchtigun-gen möglich","Production not at production location;\n\n\nNegative quality impacts possible",{"$nulls":9},"Fertigung nicht am Produktionsstandort; \n \n\nQualitätsbeeinträchtigun-gen möglich"]
["Festlegung des Kontextes („Scope“) des zu liefernden Softwareproduktes","Definition of scope of the software product",{"$nulls":9},"Festlegung des Kontextes („Scope“) des zu liefernden Softwareproduktes"]
["Festlegung Grenzmuster","Definition of boundary samples",{"$nulls":9},"Festlegung Grenzmuster"]
["Festlegung Porenklassen","Definition of pore classes",{"$nulls":9},"Festlegung Porenklassen"]
["Freigabe Einzelteile","Single part approval",{"$nulls":9},"Freigabe Einzelteile"]
["Freigabe Hilfs- und Betriebsstoffe","Auxiliary and operating material approval",{"$nulls":9},"Freigabe Hilfs- und Betriebsstoffe"]
["Freigabe Rohteile","Raw part approval",{"$nulls":9},"Freigabe Rohteile"]
["Funktion","Function",{"$nulls":9},"Funktion"]
["Funktion/EMV/ ESD","Function / EMC / ESD",{"$nulls":9},"Funktion/EMV/ ESD"]
["Funktion erfüllt,\nentspricht Spezifikation","Function fulfilled\nmeets specification",{"$nulls":9},"Funktion erfüllt,\nentspricht Spezifikation"]
["Funktion n. i. O. bzw. Funktion nicht nachgewiesen,\nSpezifikation nicht erfüllt","Function NOK or function not verified\nspecification not met",{"$nulls":9},"Funktion n. i. O. bzw. Funktion nicht nachgewiesen,\nSpezifikation nicht erfüllt"]
["Funktionsprüfung gemäß KLH/Spezifikation/Funktions-vorschriften","Functional test acc. to CRS/specification/functional regulations",{"$nulls":9},"Funktionsprüfung gemäß KLH/Spezifikation/Funktions-vorschriften"]
["Gemäß Prozessablauf","According to process sequence",{"$nulls":9},"Gemäß Prozessablauf"]
["Genehmigte Konstruktionsänderungen","Approved design changes",{"$nulls":9},"Genehmigte Konstruktionsänderungen"]
["Generelle Nachweise","General deliverables",{"$nulls":9},"Generelle Nachweise"]
["Generelle Nachweise","General deliverables",{"$nulls":9},"Generelle Nachweise"]
["Geometrie, Maß","Geometry, dimensions",{"$nulls":9},"Geometrie, Maß"]
["Geruch","Odor",{"$nulls":9},"Geruch"]
["Geruchsprüfung","Odor",{"$nulls":9},"Geruchsprüfung"]
["Gestuftes PPF-Verfahren","Stepped PPA procedure",{"$nulls":9},"Gestuftes PPF-Verfahren"]
["gestuftes PPF-Verfahren (Bitte unten vereinbaren, die Termine der einzelnen PPF-Stufen angeben und die notwendigen Dokumente je Vorgang planen)","Step PPA procedure (please arrange below, specify the dates of the individual PPA steps, and plan the necessary documents for each operation)",{"$nulls":9},"gestuftes PPF-Verfahren (Bitte unten vereinbaren, die Termine der einzelnen PPF-Stufen angeben und die notwendigen Dokumente je Vorgang planen)"]
["ggf. Anhang für Auflistung aller betroffenen Sachnrn. verwenden","Use Appendix for list of all relevant part numbers if necessary",{"$nulls":9},"ggf. Anhang für Auflistung aller betroffenen Sachnrn. verwenden"]
["Grund der Berichterstellung","Reason for report creation",{"$nulls":9},"Grund der Berichterstellung"]
["Gültigkeit","Validity",{"$nulls":9},"Gültigkeit"]
["Haptik","Haptics",{"$nulls":9},"Haptik"]
["Haptikprüfung","Haptics",{"$nulls":9},"Haptikprüfung"]
["Hardwarefreigabe","Hardware approval",{"$nulls":9},"Hardwarefreigabe"]
["Hardwarefreigabe erforderlich","Hardware approval required",{"$nulls":9},"Hardwarefreigabe erforderlich"]
["Hardwarefreigabe erforderlich","Hardware approval required",{"$nulls":9},"Hardwarefreigabe erforderlich"]
["Hardwarestand","Hardware version",{"$nulls":9},"Hardwarestand"]
["i. O.  ","OK",{"$nulls":9},"i. O.  "]
["IMDS-ID Kunde","IMDS ID of customer",{"$nulls":9},"IMDS-ID Kunde"]
["Inhalte","Contents",{"$nulls":9},"Inhalte"]
["Gesamtbewertung durch die Organisation","Overall evaluation by organization",{"$nulls":9},"Gesamtbewertung durch die Organisation"]
["IST-Werte Organisation","Actual values of organization",{"$nulls":9},"IST-Werte Organisation"]
["Kategorie","Category",{"$nulls":9},"Kategorie"]
["Kein geschultes oder in ausreichender Anzahl verfügbares Personal,\nQualitätsbeeinträchtigun-gen möglich (4)","No trained personnel or not enough personnel available\nnegative quality impacts possible *4",{"$nulls":9},"Kein geschultes oder in ausreichender Anzahl verfügbares Personal,\nQualitätsbeeinträchtigun-gen möglich (4)"]
["Qualifiziertes Personal nicht in ausreichender Anzahl verfügbar:\nQualitätsbeeinträchtigungen möglich\nArbeits- und/oder Prüfanweisungen unvollständig","Not enough qualified personnel available:\nnegative quality impacts possible\nwork and/or inspection instructions not completely available",{"$nulls":9},"Qualifiziertes Personal nicht in ausreichender Anzahl verfügbar:\nQualitätsbeeinträchtigungen möglich\nArbeits- und/oder Prüfanweisungen unvollständig"]
["Kein Serienwerkstoff oder andere Verarbeitung,\nKundenakzeptanz liegt vor ","No series material or other processing\ncustomer acceptance granted ",{"$nulls":9},"Kein Serienwerkstoff oder andere Verarbeitung,\nKundenakzeptanz liegt vor "]
["Kein Serienwerkstoff,\nSpezifikation nicht erfüllt/nicht nachgewiesen","No series material\nspecification not met/not verified.",{"$nulls":9},"Kein Serienwerkstoff,\nSpezifikation nicht erfüllt/nicht nachgewiesen"]
["Kennung/DUNS","Identification/DUNS",{"$nulls":9},"Kennung/DUNS"]
["Kennzeichnung der Lieferung","Delivery identification",{"$nulls":9},"Kennzeichnung der Lieferung"]
["Kommentar","Comment",{"$nulls":9},"Kommentar"]
["Kommentar Kunde","Comment of customer",{"$nulls":9},"Kommentar Kunde"]
["Kommentar Organisation","To be provided by the customer",{"$nulls":9},"Kommentar Organisation"]
["Konstruktions-, Entwicklungsfreigaben","Design, development approvals",{"$nulls":9},"Konstruktions-, Entwicklungsfreigaben"]
["Konstruktions-, Entwicklungsfreigaben der Organisation bei Entwicklungsverantwortung entsprechend Vereinbarung","Design, engineering approvals by organization in case of development responsibility as per agreement",{"$nulls":9},"Konstruktions-, Entwicklungsfreigaben der Organisation bei Entwicklungsverantwortung entsprechend Vereinbarung"]
["Kontaktinformationen","Contact information",{"$nulls":9},"Kontaktinformationen"]
["Korrosion","Corrosion",{"$nulls":9},"Korrosion"]
["Korrosionsprüfung","Corrosion test",{"$nulls":9},"Korrosionsprüfung"]
["Kunde","Customer",{"$nulls":9},"Kunde"]
["Kunde (Empfänger)","Customer (recipient)",{"$nulls":9},"Kunde (Empfänger)"]
["Kundenspezifische Teilestände\n(z. B. TGS/ F-Stand/ Q-Stand, …)","Customer-specific part statuses (e.g. part generation version / production status / quality status, etc.)",{"$nulls":9},"Kundenspezifische Teilestände\n(z. B. TGS/ F-Stand/ Q-Stand, …)"]
["Kunden-/Serientauglich (Anforderungen erfüllt oder Abweichungen nach Risikoanalyse akzeptiert)","Customer-ready (requirements met or deviations accepted after risk analysis)",{"$nulls":9},"Kunden-/Serientauglich (Anforderungen erfüllt oder Abweichungen nach Risikoanalyse akzeptiert)"]
["Kundentauglich/Serientauglich","Customer-ready/Ready for series production",{"$nulls":9},"Kundentauglich/Serientauglich"]
["Kunden-/Serientauglich nach Risikobewertung,\naktualisierte PPF-Dokumentation erforderlich"," Customer-ready after risk assessment\nUpdated PPA documentation required",{"$nulls":9},"Kunden-/Serientauglich nach Risikobewertung,\naktualisierte PPF-Dokumentation erforderlich"]
["Kundenteilnahme bei Prozessabnahme gewünscht","Customer participation desired for process acceptance",{"$nulls":9},"Kundenteilnahme bei Prozessabnahme gewünscht"]
["Laborqualifizierung","Laboratory qualification",{"$nulls":9},"Laborqualifizierung"]
["Lacktechnik","Paint technology",{"$nulls":9},"Lacktechnik"]
["Lieferantennummer/ \nDUNS-Code","Supplier number/ \nDUNS Code:",{"$nulls":9},{"$f":"VLOOKUP(A196,A:J,$L$1,FALSE)","v":"Lieferantennummer/ \nDUNS-Code"}]
["Liefermenge","Delivery quantity",{"$nulls":9},"Liefermenge"]
["Lieferscheinnummer","Delivery note number",{"$nulls":9},"Lieferscheinnummer"]
["Lieferstandort","Delivery location",{"$nulls":9},"Lieferstandort"]
["Liste bekannter Fehler ","List of known errors ",{"$nulls":9},"Liste bekannter Fehler "]
["Liste mit Terminen für \nFarb-/Varianten-PPF","List with dates for color / variant PPAs",{"$nulls":9},"Liste mit Terminen für \nFarb-/Varianten-PPF"]
["Logistik (1)\n","Logistics *1",{"$nulls":9},"Logistik (1)\n"]
["Logistik: wenn zutreffend bewerten\n- zum Kunden\n- innerhalb der Organisation\n- von Lieferanten\n(z. B. Transport-, Verpackungsvorschriften erstellt, Serienverpackung in vereinbarter Menge vorhanden, keine Qualitätsbeeinträchtigung in der Serie zu erwarten)","Logistics: if applicable evaluate:\n- towards customer\n- within the organization\n- from supplier\n(e.g. transport, packaging specification created; serial packaging in agreed quantity available, no negative quality impacts to expect)",{"$nulls":9},"Logistik: wenn zutreffend bewerten\n- zum Kunden\n- innerhalb der Organisation\n- von Lieferanten\n(z. B. Transport-, Verpackungsvorschriften erstellt, Serienverpackung in vereinbarter Menge vorhanden, keine Qualitätsbeeinträchtigung in der Serie zu erwarten)"]
["E-Mail","E-mail",{"$nulls":9},"E-Mail"]
["Maß","Dimension",{"$nulls":9},"Maß"]
["Maßlich i. O., \nkeine Nacharbeit","Dimensionally OK\nno rework",{"$nulls":9},"Maßlich i. O., \nkeine Nacharbeit"]
["Maßlich i. O. \nmit Nacharbeit oder unkritische Werte n. i. O. ","Dimensionally OK\nwith rework or uncritical values NOK",{"$nulls":9},"Maßlich i. O. \nmit Nacharbeit oder unkritische Werte n. i. O. "]
["Maßlich n. i. O.","Dimensionally NOK",{"$nulls":9},"Maßlich n. i. O."]
["Materialdaten per IMDS","Material data via IMDS",{"$nulls":9},"Materialdaten per IMDS"]
["Mechanische Kennwerte","Mechanical measures",{"$nulls":9},"Mechanische Kennwerte"]
["Merkmale abgesichert","Characteristics assured",{"$nulls":9},"Merkmale abgesichert"]
["Messtechnik (optional)","Measuring department (optional)",{"$nulls":9},"Messtechnik (optional)"]
["Metallographie","Metallography",{"$nulls":9},"Metallographie"]
["Mindestens eine Produktionseinheit abgenommen (2)","At least one production unit\naccepted *2",{"$nulls":9},"Mindestens eine Produktionseinheit abgenommen (2)"]
["Mitgeltende Unterlagen zum PPF-Verfahren","Applicable documents for the PPA procedure",{"$nulls":9},"Mitgeltende Unterlagen zum PPF-Verfahren"]
["Muster inkl. Fertigungsdokumentation","Sample including production documentation",{"$nulls":9},"Muster inkl. Fertigungsdokumentation"]
["Mustergewicht [kg]","Sample weight [kg]",{"$nulls":9},"Mustergewicht [kg]"]
["Mustervorstellung","Sample presentation",{"$nulls":9},"Mustervorstellung"]
["Nachforderung \nVorzulegende Dokumente zu offenen Prüfgebieten","Subsequent requirement\nDocuments to be submitted about open test areas",{"$nulls":9},"Nachforderung \nVorzulegende Dokumente zu offenen Prüfgebieten"]
["Nachforderung/Begründung","Subsequent requirement / reason",{"$nulls":9},"Nachforderung/Begründung"]
["Nachweis einer Prozessbewertung (z. B. Automotive Spice)","Documentation of a process evaluation (e.g. VDA Automotive Spice)",{"$nulls":9},"Nachweis einer Prozessbewertung (z. B. Automotive Spice)"]
["Nachweis Einhaltung werkstoffspezifischer Kundennormen","Evidence of compliance with material related customer standards",{"$nulls":9},"Nachweis Einhaltung werkstoffspezifischer Kundennormen"]
["Nachweis Umsetzung der Anforderungen 6.3 u. 6.4","Implementation of the requirements from 6.3 and 6.4, especially the Special Characteristics",{"$nulls":9},"Nachweis Umsetzung der Anforderungen 6.3 u. 6.4"]
["Nachweis-      \ndokument","Deliverable",{"$nulls":9},"Nachweis-      \ndokument"]
["Nachweise zum Produktionsprozess","Deliverables of production process",{"$nulls":9},"Nachweise zum Produktionsprozess"]
["Nachweise zur Einhaltung gesetzlicher Anforderungen ","Evidence of compliance with statutory requirements ",{"$nulls":9},"Nachweise zur Einhaltung gesetzlicher Anforderungen "]
["Nachweise zum Produkt","Deliverables of product",{"$nulls":9},"Nachweise zum Produkt"]
["Nachweise zur Produktentwicklung","Deliverables of product development",{"$nulls":9},"Nachweise zur Produktentwicklung"]
["Nachweise zur Produktionsprozessentwicklung","Deliverables of production process development",{"$nulls":9},"Nachweise zur Produktionsprozessentwicklung"]
["Nachweise zur Software","Deliverables for software",{"$nulls":9},"Nachweise zur Software"]
["Nachweise zur Validierung des Produktes","Deliverables of the validation of the product",{"$nulls":9},"Nachweise zur Validierung des Produktes"]
["Nachweise zur Validierung des Produktionsprozesses","Deliverables of the validation of the production process",{"$nulls":9},"Nachweise zur Validierung des Produktionsprozesses"]
["Nachweiskategorie","Deliverable category",{"$nulls":9},"Nachweiskategorie"]
["Name","Name",{"$nulls":9},"Name"]
["Name der Organisation","Name of organization",{"$nulls":9},"Name der Organisation"]
["Name des Kunden","Name of customer",{"$nulls":9},"Name des Kunden"]
["Neue Spezifikation","New specification",{"$nulls":9},"Neue Spezifikation"]
["Neues PPF-Verfahren erforderlich","New PPA procedure required",{"$nulls":9},"Neues PPF-Verfahren erforderlich"]
["Neuteil","New part",{"$nulls":9},"Neuteil"]
["Nicht anwendbar","Not applicable",{"$nulls":9},"Nicht anwendbar"]
["Nicht gemäß Prozessablauf, aber keine Qualitäts-beeinträchtigungen in der Serie zu erwarten","Not according to process sequence but no negative quality impacts expected in series production",{"$nulls":9},"Nicht gemäß Prozessablauf, aber keine Qualitäts-beeinträchtigungen in der Serie zu erwarten"]
["Nicht kundentauglich/ \nNicht serientauglich","Not customer-ready / \nNot ready for series production",{"$nulls":9},"Nicht kundentauglich/ \nNicht serientauglich"]
["Nicht kundentauglich/\n Nicht serientauglich","Not customer-ready / \nNot ready for series production",{"$nulls":9},"Nicht kundentauglich/\n Nicht serientauglich"]
["Nicht kunden- oder serientauglich bzw. noch nicht freigegeben","Not customer-ready or not approved yet",{"$nulls":9},"Nicht kunden- oder serientauglich bzw. noch nicht freigegeben"]
["Nicht verbaubar","Not capable for assembly",{"$nulls":9},"Nicht verbaubar"]
["Nicht vorhanden/         nicht abgenommen","Not available\n/ not accepted",{"$nulls":9},"Nicht vorhanden/         nicht abgenommen"]
["Normen","Standards",{"$nulls":9},"Normen"]
["Nr.","No.",{"$nulls":9},"Nr."]
["Nur teilweise vorhanden/abgenommen,\ngeeignetes Ersatzprüfmittel vorhanden","Only partially available / accepted\nsuitable substitute test equipment available",{"$nulls":9},"Nur teilweise vorhanden/abgenommen,\ngeeignetes Ersatzprüfmittel vorhanden"]
["Oberfläche/ Struktur\nFarbe/Narbung","Surface / structure\ncolor / graining",{"$nulls":9},"Oberfläche/ Struktur\nFarbe/Narbung"]
["Oberfläche, Narbung","Surface, graining",{"$nulls":9},"Oberfläche, Narbung"]
["Oberflächenanforderung","Surface requirement",{"$nulls":9},"Oberflächenanforderung"]
["Ordnungs-    nummer","Order number",{"$nulls":9},"Ordnungs-    nummer"]
["Organisation","Organization",{"$nulls":9},"Organisation"]
["Organisation","Organization:",{"$nulls":9},"Organisation"]
["Original","Original",{"$nulls":9},"Original"]
["Papierform","Paper form",{"$nulls":9},"Papierform"]
["PDF-Format","PDF format",{"$nulls":9},"PDF-Format"]
["Personal","Human Resources",{"$nulls":9},"Personal"]
["Personal nur eingeschränkt verfügbar/geschult, keine Qualitätsbeeinträchtigun-gen zu erwarten (3)","Only limited personnel available / trained, no negative quality impacts expected *3",{"$nulls":9},{"$f":"VLOOKUP(A260,A:J,$L$1,FALSE)","v":"Personal nur eingeschränkt verfügbar/geschult, keine Qualitätsbeeinträchtigun-gen zu erwarten (3)"}]
["Personal nur eingeschränkt verfügbar/qualifiziert, keine Qualitätsbeeinträchtigungen zu erwarten:\n- Anzahl und Qualifikationsgrad müssen noch optimiert werden\n- Arbeits- und Prüfanweisungen vollständig","Only limited personnel available/qualified, no negative quality impacts expected:\n- number and qualification still have to be optimized\n- work and inspection instructions completely available",{"$nulls":9},"Personal nur eingeschränkt verfügbar/qualifiziert, keine Qualitätsbeeinträchtigungen zu erwarten:\n- Anzahl und Qualifikationsgrad müssen noch optimiert werden\n- Arbeits- und Prüfanweisungen vollständig"]
["Portal","Portal",{"$nulls":9},"Portal"]
["PPF-Bewertung","PPA evaluation",{"$nulls":9},"PPF-Bewertung"]
["PPF-Status Lieferkette","PPA status of supply chain",{"$nulls":9},"PPF-Status Lieferkette"]
["PPF-Status Lieferkette*","PPA status of supply chain*",{"$nulls":9},"PPF-Status Lieferkette"]
["PPF-Termin","PPA date",{"$nulls":9},"PPF-Termin"]
["PPF-Verfahren für Produktfamilie","PPA procedure for product family",{"$nulls":9},"PPF-Verfahren für Produktfamilie"]
["PPF-Verfahren zum Kunden abgeschlossen","PPA procedure towards customer closed",{"$nulls":9},"PPF-Verfahren zum Kunden abgeschlossen"]
["Probeentnahmeplan","Sample extraction plan",{"$nulls":9},"Probeentnahmeplan"]
["Produktänderung","Product change",{"$nulls":9},"Produktänderung"]
["Produktbezogene Nachweise","Product-related deliverables",{"$nulls":9},"Produktbezogene Nachweise"]
["Produktionsdatum","Production date",{"$nulls":9},"Produktionsdatum"]
["Produktionseinrichtungen nicht abgenommen (2)","Production facilities not accepted *2",{"$nulls":9},"Produktionseinrichtungen nicht abgenommen (2)"]
["Produktionskapazität","Production capacity",{"$nulls":9},"Produktionskapazität"]
["Produktionslenkungsplan","Control plan (CP)",{"$nulls":9},"Produktionslenkungsplan"]
["Produktionsstandort","Production location",{"$nulls":9},"Produktionsstandort"]
["Produktions-     standort","Production location",{"$nulls":9},"Produktions-     standort"]
["Produktionsstückzahl\ndauerhaft erreichbar mit Sondermaßnahmen","Production quantity\npermanently reachable with special measures",{"$nulls":9},"Produktionsstückzahl\ndauerhaft erreichbar mit Sondermaßnahmen"]
["Produktionsstückzahl\nerreicht/nachgewiesen","Production quantity\nreached / verified",{"$nulls":9},"Produktionsstückzahl\nerreicht/nachgewiesen"]
["Produktionsstückzahl \nmit Sondermaßnahmen nicht erreichbar","Production quantity\nnot reachable with special measures",{"$nulls":9},"Produktionsstückzahl \nmit Sondermaßnahmen nicht erreichbar"]
["Projektleiter (optional)","Project manager (optional)",{"$nulls":9},"Projektleiter (optional)"]
["Prozess","Process",{"$nulls":9},"Prozess"]
["Prozessablaufdiagramm","Process flowchart",{"$nulls":9},"Prozessablaufdiagramm"]
["Produktionsprozessabnahme erforderlich","Process acceptance required (see above)",{"$nulls":9},"Produktionsprozessabnahme erforderlich"]
["Prozessänderung","Production process change",{"$nulls":9},"Prozessänderung"]
["Produktionsprozess-bezogene und generelle Nachweise","Productionprocess-related and general deliverables",{"$nulls":9},"Produktionsprozess-bezogene und generelle Nachweise"]
["Prozess-FMEA","Process FMEA",{"$nulls":9},"Prozess-FMEA"]
["Prüf-/Messprotokolle bzw. Abnahmeprotokolle für Lehren","Test/measurement reports or acceptance test reports for gages",{"$nulls":9},"Prüf-/Messprotokolle bzw. Abnahmeprotokolle für Lehren"]
["Prüfgebiet","Test area",{"$nulls":9},"Prüfgebiet"]
["Prüfmittel","Test equipment",{"$nulls":9},"Prüfmittel"]
["Prüfmittelfähigkeitsnachweis Produkt u. Produktionsprozess","Measurement equipment analysis studies product and production process",{"$nulls":9},"Prüfmittelfähigkeitsnachweis Produkt u. Produktionsprozess"]
["Prüfmittelliste Produkt und Produktionsprozess","Test equipment list for product and production process",{"$nulls":9},"Prüfmittelliste Produkt und Produktionsprozess"]
["Prüfungen durch Kunde","Tests by customer",{"$nulls":9},"Prüfungen durch Kunde"]
["Prüfvorschriften","Test regulations",{"$nulls":9},"Prüfvorschriften"]
["Qualitätsbeeinträchtigun-gen möglich","Negative quality impacts possible",{"$nulls":9},"Qualitätsbeeinträchtigun-gen möglich"]
["Qualitäts-management","Quality management",{"$nulls":9},"Qualitäts-management"]
["Referenz zu vertraglich festgelegten Qualitätsanforderungen\n(z. B. Coding Guidelines, Codemetriken, Testabdeckung)","Reference to contractually stipulated quality requirements ",{"$nulls":9},"Referenz zu vertraglich festgelegten Qualitätsanforderungen\n(z. B. Coding Guidelines, Codemetriken, Testabdeckung)"]
["Referenz-Berichtsnummer Kunden","Reference report number of customer",{"$nulls":9},"Referenz-Berichtsnummer Kunden"]
["Referenz-Berichtsnummer Organisation","Reference report number of organization",{"$nulls":9},"Referenz-Berichtsnummer Organisation"]
["Referenzmuster","Master sample",{"$nulls":9},"Referenzmuster"]
["Requalifikation","Requalification",{"$nulls":9},"Requalifikation"]
["Risikobewertung","Risk assessment",{"$nulls":9},"Risikobewertung"]
["Rohteilmessung","Raw part measurement",{"$nulls":9},"Rohteilmessung"]
["Sachnummer","Part Number",{"$nulls":9},"Sachnummer"]
["Schnitte","Sections",{"$nulls":9},"Schnitte"]
["Stufe 1","Step 1",{"$nulls":9},"Stufe 1"]
["Stufe 2","Step 2",{"$nulls":9},"Stufe 2"]
["Stufe 3","Step 3",{"$nulls":9},"Stufe 3"]
["Stufe 4","Step 4",{"$nulls":9},"Stufe 4"]
["Schritt bei gestuftem PPF-Verfahren","Step for stepped PPA procedure",{"$nulls":9},"Schritt bei gestuftem PPF-Verfahren"]
["Selbstbeurteilung Organisation","Self-assessment of organization",{"$nulls":9},"Selbstbeurteilung Organisation"]
["Selbstbeurteilung Produkt","Self-assessment product ",{"$nulls":9},"Selbstbeurteilung Produkt"]
["Selbstbeurteilung Produkt, Produktionsprozess und ggf. Software","Self-assessment for product, process, SW (if appl.) ",{"$nulls":9},"Selbstbeurteilung Produkt, Produktionsprozess und ggf. Software"]
["Selbstbeurteilung Produktionsprozess","Self-assessment production process ",{"$nulls":9},"Selbstbeurteilung Produktionsprozess"]
["Serienwerkstoff\ngemäß Spezifikation","Series material\nacc. to specification",{"$nulls":9},"Serienwerkstoff\ngemäß Spezifikation"]
["Serienwerkzeug \nabgenommen","Series tool\naccepted",{"$nulls":9},"Serienwerkzeug \nabgenommen"]
["Serienwerkzeug/Kleinserienwerkzeug vorhanden, Optimierung(en) noch nötig, aber keine Qualitätsbeeinträchtigun-gen in der Serie zu erwarten","Series tool / small series tool available, optimization(s) still necessary, but no negative quality impacts expected in series production",{"$nulls":9},"Serienwerkzeug/Kleinserienwerkzeug vorhanden, Optimierung(en) noch nötig, aber keine Qualitätsbeeinträchtigun-gen in der Serie zu erwarten"]
["Setzteile","Directed parts",{"$nulls":9},"Setzteile"]
["Setzteile mit Q-Verantwortung der Organisation","Directed parts with Q-responsibility of organization",{"$nulls":9},"Setzteile mit Q-Verantwortung der Organisation"]
["Setzteile mit Q-Verantwortung des Kunden","Directed parts with Q-responsibility of customer",{"$nulls":9},"Setzteile mit Q-Verantwortung des Kunden"]
["Sind Alternativlieferanten vorgesehen?","Are alternative deliveries provided for",{"$nulls":9},"Sind Alternativlieferanten vorgesehen?"]
["Sind Ausweichmaschinen oder -prozesse geplant?","Are deviating machines or processes planned",{"$nulls":9},"Sind Ausweichmaschinen oder -prozesse geplant?"]
["Nachweise zur Software","Software deliverables",{"$nulls":9},"Nachweise zur Software"]
["Softwarefreigabe","Software approval",{"$nulls":9},{"$f":"VLOOKUP(A324,A:J,$L$1,FALSE)","v":"Softwarefreigabe"}]
["Softwarefreigabe erforderlich","Software approval required",{"$nulls":9},"Softwarefreigabe erforderlich"]
["Softwarestand","Software version",{"$nulls":9},"Softwarestand"]
["Sonstiges","Other",{"$nulls":9},"Sonstiges"]
["Spezifikation erfüllt","Specification met",{"$nulls":9},"Spezifikation erfüllt"]
["Standardlehrenbericht","Standard gage report",{"$nulls":9},"Standardlehrenbericht"]
["Standardmessbericht (alle Zeichnungsmerkmale)","Standard measurement report (all drawing characteristics)",{"$nulls":9},"Standardmessbericht (alle Zeichnungsmerkmale)"]
["SW-Einsatzfreigabe (z. B. Anlage 5 „Deckblatt PPF Software“)","Software release (e.g. Appendix 5 \"Cover sheet for PPA software\")",{"$nulls":9},"SW-Einsatzfreigabe (z. B. Anlage 5 „Deckblatt PPF Software“)"]
["Technische Kundenunterlagen","Technical customer documents",{"$nulls":9},"Technische Kundenunterlagen"]
["Technische Sauberkeit","Technical cleanliness",{"$nulls":9},"Technische Sauberkeit"]
["Technische Spezifikationen ","Technical specifications ",{"$nulls":9},"Technische Spezifikationen "]
["Teil 1","Part 1",{"$nulls":9},"Teil 1"]
["Teil 2","Part 2",{"$nulls":9},"Teil 2"]
["Teil 3","Part 3",{"$nulls":9},"Teil 3"]
["Teil 4","Part 4",{"$nulls":9},"Teil 4"]
["Teil 5","Part 5",{"$nulls":9},"Teil 5"]
["Teilebündelung/Produktfamilien","Part grouping / Product families",{"$nulls":9},"Teilebündelung/Produktfamilien"]
["Teilelebenslauf","Part history",{"$nulls":9},"Teilelebenslauf"]
["Teilelebenslauf in der Serie","Part history in series production",{"$nulls":9},"Teilelebenslauf in der Serie"]
["Telefon","Telephone",{"$nulls":9},"Telefon"]
["Terminabstimmung","Scheduling",{"$nulls":9},"Terminabstimmung"]
["Übermittlung der PPF-Unterlagen","Submission of PPA documents",{"$nulls":9},"Übermittlung der PPF-Unterlagen"]
["Übermittlungssprache des PPF-Verfahrens","PPA procedure submission language",{"$nulls":9},"Übermittlungssprache des PPF-Verfahrens"]
["Unterlagen","Documents",{"$nulls":9},"Unterlagen"]
["Unterschrift","Signature",{"$nulls":9},"Unterschrift"]
["Varianten","Variants",{"$nulls":9},"Varianten"]
["Varianten","Variants",{"$nulls":9},"Varianten"]
["Varianten-PPF","Variant PPA",{"$nulls":9},"Varianten-PPF"]
["Varianten-PPF zu bereits vorgelegtem PPF-Verfahren","Variant PPA for PPA procedure already submitted",{"$nulls":9},"Varianten-PPF zu bereits vorgelegtem PPF-Verfahren"]
["Verbaubar \nohne Mehraufwand","Capable for assembly\nwith no additional expenditure",{"$nulls":9},"Verbaubar \nohne Mehraufwand"]
["Verbaubar mit Mehraufwand,\nKundenakzeptanz liegt vor ","Capable for assembly with additional expenditure\ncustomer acceptance granted ",{"$nulls":9},"Verbaubar mit Mehraufwand,\nKundenakzeptanz liegt vor "]
["Verbaubarkeit","customer acceptance granted ",{"$nulls":9},"Verbaubarkeit"]
["Verbaubarkeit (beim Kunden)","Assembly capability (at customer site)",{"$nulls":9},"Verbaubarkeit (beim Kunden)"]
["Vereinbarte Produktions-stückzahl","Agreed production quantity",{"$nulls":9},"Vereinbarte Produktions-stückzahl"]
["Vereinbarte Produktionsstückzahl: \nProduktionseinrichtungen beziehen sich auf Linien/Anlagen/Maschinen/Werkzeuge/Kavitäten/Nester","Agreed production quantity:\nProduction equipment refers to lines / equipments / machines / tools / jigs / cavities",{"$nulls":9},"Vereinbarte Produktionsstückzahl: \nProduktionseinrichtungen beziehen sich auf Linien/Anlagen/Maschinen/Werkzeuge/Kavitäten/Nester"]
["Vereinbarte Vorgehensweise (z. B. Dauer bzw. Stückzahl des Tests)","Agreed procedure (e.g. duration, test quantity)",{"$nulls":9},"Vereinbarte Vorgehensweise (z. B. Dauer bzw. Stückzahl des Tests)"]
["Version","Version",{"$nulls":9},"Version"]
["Version/ Datum","Version / Date",{"$nulls":9},"Version/ Datum"]
["Vollständig vorhanden/abgenommen,\nFähigkeit nachgewiesen","Completely available / accepted\ncapability verified",{"$nulls":9},"Vollständig vorhanden/abgenommen,\nFähigkeit nachgewiesen"]
["Vom Kunden zur Verfügung zu stellen","To be provided by the customer",{"$nulls":9},"Vom Kunden zur Verfügung zu stellen"]
["von","of",{"$nulls":9},"von"]
["Von der Organisation zur Verfügung zu stellen","To be provided by the organization",{"$nulls":9},"Von der Organisation zur Verfügung zu stellen"]
["Vorlage erforderlich","Submission required",{"$nulls":9},"Vorlage erforderlich"]
["Werkstoff","Material",{"$nulls":9},"Werkstoff"]
["Werkstoff (Festigkeit, physikalische Eigenschaften, …)","Material (strength, physical properties, etc.)",{"$nulls":9},"Werkstoff (Festigkeit, physikalische Eigenschaften, …)"]
["Werkstofftechnik (optional)","Material department (optional)",{"$nulls":9},"Werkstofftechnik (optional)"]
["Werkzeug nicht serientauglich\n\nQualitätsbeeinträchtigun-gen in der Serie zu erwarten","Tool not ready for series production\n\nnegative quality impacts expected in series production",{"$nulls":9},"Werkzeug nicht serientauglich\n\nQualitätsbeeinträchtigun-gen in der Serie zu erwarten"]
["Werkzeuge","Tools",{"$nulls":9},"Werkzeuge"]
["Werkzeuge (mit Stückzahl/Anzahl Nester und Information zum Werkzeugkonzept)","Tools (with quantity/number of cavities and information about tool concept)",{"$nulls":9},"Werkzeuge (mit Stückzahl/Anzahl Nester und Information zum Werkzeugkonzept)"]
["Wiedernutzung > 12 Monate Stillstand","Re-use > 12 months standstill",{"$nulls":9},"Wiedernutzung > 12 Monate Stillstand"]
["Zeichnungsnummer","Drawing number",{"$nulls":9},"Zeichnungsnummer"]
["Zonenfestlegung für optische Beurteilung","Zone definition for optical assessment",{"$nulls":9},"Zonenfestlegung für optische Beurteilung"]
["Zur Verfügung zu stellende Schnittstellenbauteile und Hilfsmittel","Interface components and auxiliary materials to be made available",{"$nulls":9},"Zur Verfügung zu stellende Schnittstellenbauteile und Hilfsmittel"]
["Zuverlässigkeit","Reliability",{"$nulls":9},"Zuverlässigkeit"]
["Bericht","Report",{"$nulls":9},"Bericht"]
["Eingabe erforderlich, sofern nicht mit „Anforderung erfüllt“ bewertet","Input mandatory, if other evaluation then \"Requirements met\"",{"$nulls":9},"Eingabe erforderlich, sofern nicht mit „Anforderung erfüllt“ bewertet"]
["Nicht anwendbar","Not applicable",{"$nulls":9},"Nicht anwendbar"]
["Bestandteil Requalifikation","Scope of \"Requalifikation\" (L.I. & funct. test)",{"$nulls":9},"Bestandteil Requalifikation"]
["Abstimmung Requalifikation","Alignment \"Requalifikation\" (L.I. & funct. test)",{"$nulls":9},"Abstimmung Requalifikation"]
["Requalifikationsintervall","Intervall \"Requalifikation\" (L.I. & funct. test)",{"$nulls":9},"Requalifikationsintervall"]
["Weitergabe an den Kunden","Forward to customer",{"$nulls":9},"Weitergabe an den Kunden"]
["Nur Nachweis","Evidence only",{"$nulls":9},"Nur Nachweis"]
["Dokumentation","Documentation",{"$nulls":9},"Dokumentation"]
["Liegen bei der Requalifikation Abweichungen zu den Spezifikationen vor, ist der Kunde in jedem Fall zu informieren.","In case deviations to specifications are discovered during \"Requalifikation\" (L.I: & funct. test), the customer has to be informed.",{"$nulls":9},"Liegen bei der Requalifikation Abweichungen zu den Spezifikationen vor, ist der Kunde in jedem Fall zu informieren."]
["Abstimmung zum PPF-Verfahren ","PPA Agreement",{"$nulls":9},{"$f":"VLOOKUP(A388,A:J,$L$1,FALSE)","v":"Abstimmung zum PPF-Verfahren "}]
["Änd.-Nummer Organisation","Change number organization",{"$nulls":9},"Änd.-Nummer Organisation"]
["Verantwortliche Person","Responsible person",{"$nulls":9},"Verantwortliche Person"]
["Kopfdaten","Header",{"$nulls":9},"Kopfdaten"]
["6.1 Deckblatt PPF Software","6.1 Cover sheet for PPA software ",{"$nulls":9},"6.1 Deckblatt PPF Software"]
["Auszufüllen von Organisation","To be filled out by the organization",{"$nulls":9},"Auszufüllen von Organisation"]
["Erstellungsdatum","Report date",{"$nulls":9},"Erstellungsdatum"]
["Sachnummer (Kunde)","Part number (customer) ",{"$nulls":9},"Sachnummer (Kunde)"]
["Stücklistenreferenz (Kunde)","Parts list reference (customer)\n(optional)",{"$nulls":9},"Stücklistenreferenz (Kunde)"]
["Benennung des Kunden","Release name (customer)",{"$nulls":9},"Benennung des Kunden"]
["Sachnummer (Organisation)\nz. B. FSW-release: 18A-EMS71-ME0850","Part number (organization)\ne.g. FSW-release: 18A-EMS71-ME0850",{"$nulls":9},"Sachnummer (Organisation)\nz. B. FSW-release: 18A-EMS71-ME0850"]
["Beschreibung der Software","Description of software",{"$nulls":9},"Beschreibung der Software"]
["Produktspezifischer Kenner/Schlüssel","Product-specific identifier/key",{"$nulls":9},"Produktspezifischer Kenner/Schlüssel"]
["Prüfsumme","Checksum",{"$nulls":9},"Prüfsumme"]
["Angaben zu verwendeten Softwaremodulen (Eigen- und Fremdanteile sind aufzuführen)","Information about the software modules used (please list in-house and third-party components)\nConfiguration details",{"$nulls":9},"Angaben zu verwendeten Softwaremodulen (Eigen- und Fremdanteile sind aufzuführen)"]
["Eigenständiges Softwarepaket","Independent software package",{"$nulls":9},"Eigenständiges Softwarepaket"]
["HW-Verwendung","Assembled in following HW",{"$nulls":9},"HW-Verwendung"]
["Softwarestand","Software version",{"$nulls":9},"Softwarestand"]
["Betriebssystem","Operating system",{"$nulls":9},"Betriebssystem"]
["Diagnoseerkennung","Diagnosis version",{"$nulls":9},"Diagnoseerkennung"]
["ASIL-Einstufung","ASIL classification",{"$nulls":9},"ASIL-Einstufung"]
["Kompa-tibilität zur Spezifi-kation","Compatibility with specification",{"$nulls":9},"Kompa-tibilität zur Spezifi-kation"]
["erfüllt","Fulfilled",{"$nulls":9},"erfüllt"]
["nicht erfüllt","Not Fulfilled",{"$nulls":9},"nicht erfüllt"]
["(6.6) FOSS-Freigabe","(6.6) FOSS-Approval",{"$nulls":9},"(6.6) FOSS-Freigabe"]
["liegt vor","Available",{"$nulls":9},"liegt vor"]
["liegt nicht vor","Not available",{"$nulls":9},"liegt nicht vor"]
["nicht relevant","Not relevant",{"$nulls":9},"nicht relevant"]
["Auslöser","Trigger",{"$nulls":9},"Auslöser"]
["Initiales PPF-Verfahren","Initial PPA procedure",{"$nulls":9},"Initiales PPF-Verfahren"]
["PPF-Verfahren aufgrund von Änderungen","PPA procedure due to changes",{"$nulls":9},"PPF-Verfahren aufgrund von Änderungen"]
["Anforderung nicht erfüllt","Requirements not met",{"$nulls":9},"Anforderung nicht erfüllt"]
["Datum der letzten Prozessbewertung","Date of last\nevaluation",{"$nulls":9},"Datum der letzten Prozessbewertung"]
["Methode zur Prozessbewertung","Process evaluation method",{"$nulls":9},"Methode zur Prozessbewertung"]
["Ergebnis der Prozessbewertung","Process evaluation result",{"$nulls":9},"Ergebnis der Prozessbewertung"]
["Spezifikation und Nachweise","Specification and deliverables",{"$nulls":9},"Spezifikation und Nachweise"]
["Details zur Verwendung von Softwaremodulen","Details for usage of software modules",{"$nulls":9},"Details zur Verwendung von Softwaremodulen"]
["SW-SNR","SW-PNR",{"$nulls":9},"SW-SNR"]
["Benennung des Kunden","Customer description",{"$nulls":9},"Benennung des Kunden"]
["Bezeichnung der Organisation","Designation of organization",{"$nulls":9},"Bezeichnung der Organisation"]
["Testreport","Test report",{"$nulls":9},"Testreport"]
["Freigabestatus","Approval status",{"$nulls":9},"Freigabestatus"]
["Einsatzempfehlung der Organisation","Usage recommendation of organization",{"$nulls":9},"Einsatzempfehlung der Organisation"]
["(Von einer autorisierten Person bei der Organisation durch rechtsverbindliche Unterschrift [schriftlich, elektronisch] gegebene Erlaubnis, die Software für den vorgesehenen Einsatzzweck zu benutzen)","(To use the software for the intended application by an authorized person with the organization thorough permission granted via legally binding signature (handwritten, electronic))",{"$nulls":9},"(Von einer autorisierten Person bei der Organisation durch rechtsverbindliche Unterschrift [schriftlich, elektronisch] gegebene Erlaubnis, die Software für den vorgesehenen Einsatzzweck zu benutzen)"]
["(Von einer autorisierten Person beim Kunden durch rechtsverbindliche Unterschrift [schriftlich, elektronisch] gegebene Erlaubnis, die Software für den vorgesehenen Einsatzzweck zu benutzen)","(To use the software for the intended application by an authorized person with the customer company thorough permission granted via legally binding signature (handwritten, electronic))",{"$nulls":9},"(Von einer autorisierten Person beim Kunden durch rechtsverbindliche Unterschrift [schriftlich, elektronisch] gegebene Erlaubnis, die Software für den vorgesehenen Einsatzzweck zu benutzen)"]
["Angaben zur Software","Description about Software",{"$nulls":9},"Angaben zur Software"]
["Beschreibung der Software","Description of software",{"$nulls":9},"Beschreibung der Software"]
["Produktspezifischer Kenner/Schlüssel","Product specific identifier/key",{"$nulls":9},"Produktspezifischer Kenner/Schlüssel"]
["Prüfsumme","Checksum",{"$nulls":9},"Prüfsumme"]
["Stücklistenreferenz (Kunde)","Parts list reference\n(customer)",{"$nulls":9},"Stücklistenreferenz (Kunde)"]
["Durchgeführte Prüfungen"," Tests completed",{"$nulls":9},"Durchgeführte Prüfungen"]
["Allgemeine Angaben zur Hardware (Mindestanforderung)","General information about hardware (minimum requirement)",{"$nulls":9},"Allgemeine Angaben zur Hardware (Mindestanforderung)"]
["Prozessor","Microcontroller",{"$nulls":9},"Prozessor"]
["Prozessorfrequenz","Microcontroller frequency",{"$nulls":9},"Prozessorfrequenz"]
["Quarzfrequenz","Quartz frequency",{"$nulls":9},"Quarzfrequenz"]
["Speicherauslastung (Messung)","Memory utilization (measurement)",{"$nulls":9},"Speicherauslastung (Messung)"]
["Komponente","Component information",{"$nulls":9},"Komponente"]
["Belegt [kB]","Used [kB]",{"$nulls":9},"Belegt [kB]"]
["Verfügbar [kB]","Available [kB]",{"$nulls":9},"Verfügbar [kB]"]
["Belegt [%]","Used [%]",{"$nulls":9},"Belegt [%]"]
["ROM","ROM",{"$nulls":9},"ROM"]
["RAM","RAM",{"$nulls":9},"RAM"]
["EEPROM","EEPROM",{"$nulls":9},"EEPROM"]
["Harddisk","Harddisc",{"$nulls":9},"Harddisk"]
["Spezifikation erfüllt","Specification met",{"$nulls":9},{"$f":"VLOOKUP(A452,A:J,$L$1,FALSE)","v":"Spezifikation erfüllt"}]
["Prozessorlast Initial","Processor load Initial",{"$nulls":9},"Prozessorlast Initial"]
["Prozessorlast Betrieb","Processor load Operation",{"$nulls":9},"Prozessorlast Betrieb"]
["Prozessorlast Peak","Processor load Peak",{"$nulls":9},"Prozessorlast Peak"]
["Prozessorauslastung","Processor utilization",{"$nulls":9},"Prozessorauslastung"]
["Prozessorauslastung (Messung)","Processor utilization (measurement)",{"$nulls":9},"Prozessorauslastung (Messung)"]
["Referenz zur Dokumentation","Reference to documentation",{"$nulls":9},"Referenz zur Dokumentation"]
["Stand der Dokumentation","Status of documentation",{"$nulls":9},"Stand der Dokumentation"]
["Zugrundeliegende Konfiguration/Baseline","Aligned configuration / baseline",{"$nulls":9},"Zugrundeliegende Konfiguration/Baseline"]
["Review und Freigabe letzter Stand","Review and approval, last status",{"$nulls":9},"Review und Freigabe letzter Stand"]
["Funktionstests Softwarepaket","Function tests",{"$nulls":9},"Funktionstests Softwarepaket"]
["Geprüft nach Testspezifikation","Tested according to test specification",{"$nulls":9},"Geprüft nach Testspezifikation"]
["Alle Testsequenzen bestanden? ","All test sequences passed successfully?",{"$nulls":9},"Alle Testsequenzen bestanden? "]
["Alle Regressionstest bestanden? ","All regression tests passed successfully?",{"$nulls":9},"Alle Regressionstest bestanden? "]
["Liste nicht bestandener Tests und Risikobewertung","List of tests not passed and risk assessment",{"$nulls":9},"Liste nicht bestandener Tests und Risikobewertung"]
["Nachweis der Wirksamkeit der durchgeführten Maßnahmen","Verification of effectiveness of implemented measures",{"$nulls":9},"Nachweis der Wirksamkeit der durchgeführten Maßnahmen"]
["Welche Sonderfreigaben liegen vor?","Which special approvals have been granted?",{"$nulls":9},"Welche Sonderfreigaben liegen vor?"]
["Nachweise zur Freigabe können jederzeit durch den Kunden eingesehen werden.","Deliverables can be inspected by the customer at any time.",{"$nulls":9},"Nachweise zur Freigabe können jederzeit durch den Kunden eingesehen werden."]
["Besondere Archivierungspflicht","Special archieving requirements",{"$nulls":9},"Besondere Archivierungspflicht"]
["Unvollständig befüllt","Not completely filled",{"$nulls":9},"Unvollständig befüllt"]
["Anzahl der Nester","number of cavity",{"$nulls":9},"Anzahl der Nester"]
["Nach der Freigabe dieses EMPB darf weder der Prozess, Maschine, Produktionsstandort, Material, Lieferant, Messmittel geändert werden.\nAlle Auflagen müssen vor einer Lieferung erfüllt sein.","Process, machine, production site, material, supplier, measuring devices are not allowed to be modified after release of this PPAP. All conditions must be fulfilled before a delivery.",{"$nulls":9},"Nach der Freigabe dieses EMPB darf weder der Prozess, Maschine, Produktionsstandort, Material, Lieferant, Messmittel geändert werden.\nAlle Auflagen müssen vor einer Lieferung erfüllt sein."]
["Optionales Template: Die Inhalte können auch in geeigneter Form auf andere Art nachgewiesen werden, die spezifischen Inhalte sind zwischen Organisation und Kunde abzustimmen","Optional template: The content can also be proven in a suitable form in another way, the specific content must be agreed between the organization and the customer",{"$nulls":9},"Optionales Template: Die Inhalte können auch in geeigneter Form auf andere Art nachgewiesen werden, die spezifischen Inhalte sind zwischen Organisation und Kunde abzustimmen"]
["Sollwert","nominal value",{"$nulls":9},"Sollwert"]
["untere Toleranz","lower tolerance",{"$nulls":9},"untere Toleranz"]
["obere Toleranz","upper tolerance",{"$nulls":9},"obere Toleranz"]
["Dieses Feld ist reserviert für Bemerkungen und Texte in der Zeichnung.","This place is reserved for positions of remarks and text in the drawing",{"$nulls":9},"Dieses Feld ist reserviert für Bemerkungen und Texte in der Zeichnung."]
["Bitte Positionsnummer mit Lagebezeichnung links oder rechts oder oben oder unten usw. einfügen.","Please include the position number with description left or right or above or below and so on…",{"$nulls":9},"Bitte Positionsnummer mit Lagebezeichnung links oder rechts oder oben oder unten usw. einfügen."]
["Bitte nur den Sollwert ohne Angabe der Maßeinheit, wie mm, Grad usw. eintragen.","Please include only nominal values without descriptions as mm, degree, etc…",{"$nulls":9},"Bitte nur den Sollwert ohne Angabe der Maßeinheit, wie mm, Grad usw. eintragen."]
["Bitte nur die untere Toleranz mit Vorzeichen -(Minus) ohne Angabe der Maßeinheit, wie mm, Grad usw. eintragen.","please include the lower tolerance with prefix -(minus) without descriptions as mm, degree, etc…",{"$nulls":9},{"$f":"VLOOKUP(A481,A:J,$L$1,FALSE)","v":"Bitte nur die untere Toleranz mit Vorzeichen -(Minus) ohne Angabe der Maßeinheit, wie mm, Grad usw. eintragen."}]
["Bitte nur die obere Toleranz ohne Angabe der Maßeinheit, wie mm, Grad usw. eintragen.","please include the upper tolerance  without descriptions as mm, degree, etc…",{"$nulls":9},"Bitte nur die obere Toleranz ohne Angabe der Maßeinheit, wie mm, Grad usw. eintragen."]
["Bitte nur den gemessenen Wert ohne Angabe der Maßeinheit, wie mm, Grad usw. eintragen.","please include only the measured values without des-criptions as mm, degree, etc…",{"$nulls":9},"Bitte nur den gemessenen Wert ohne Angabe der Maßeinheit, wie mm, Grad usw. eintragen."]
[{"$nulls":11},{"$error":"#N/A"}]
[{"$nulls":11},{"$error":"#N/A"}]
[{"$nulls":11},{"$error":"#N/A"}]
[{"$nulls":11},{"$error":"#N/A"}]
[{"$nulls":11},{"$error":"#N/A"}]
[{"$nulls":11},{"$f":"VLOOKUP(A489,A:J,$L$1,FALSE)","v":{"$error":"#N/A"}}]
[{"$nulls":11},{"$error":"#N/A"}]
[{"$nulls":11},{"$error":"#N/A"}]
[{"$nulls":11},{"$error":"#N/A"}]
[{"$nulls":11},{"$error":"#N/A"}]
[{"$nulls":11},{"$error":"#N/A"}]
[{"$nulls":11},{"$error":"#N/A"}]
[{"$nulls":11},{"$error":"#N/A"}]
[{"$nulls":11},{"$error":"#N/A"}]
[{"$nulls":11},{"$error":"#N/A"}]
[{"$nulls":11},{"$error":"#N/A"}]
[{"$nulls":11},{"$error":"#N/A"}]
[{"$nulls":11},{"$error":"#N/A"}]
[{"$nulls":11},{"$error":"#N/A"}]
[{"$nulls":11},{"$error":"#N/A"}]
[{"$nulls":11},{"$error":"#N/A"}]
[{"$nulls":11},{"$error":"#N/A"}]
[{"$nulls":11},{"$error":"#N/A"}]
[{"$nulls":11},{"$error":"#N/A"}]
[{"$nulls":11},{"$error":"#N/A"}]
[{"$nulls":11},{"$error":"#N/A"}]
[{"$nulls":11},{"$error":"#N/A"}]
[{"$nulls":11},{"$error":"#N/A"}]
[{"$nulls":11},{"$error":"#N/A"}]
[{"$nulls":11},{"$error":"#N/A"}]
[{"$nulls":11},{"$error":"#N/A"}]
[{"$nulls":11},{"$error":"#N/A"}]
[{"$nulls":11},{"$error":"#N/A"}]
[{"$nulls":11},{"$error":"#N/A"}]
[{"$nulls":11},{"$error":"#N/A"}]
[{"$nulls":11},{"$error":"#N/A"}]
[{"$nulls":11},{"$error":"#N/A"}]
[{"$nulls":11},{"$error":"#N/A"}]
[{"$nulls":11},{"$error":"#N/A"}]
[{"$nulls":11},{"$error":"#N/A"}]
[{"$nulls":11},{"$error":"#N/A"}]
[{"$nulls":11},{"$error":"#N/A"}]
[{"$nulls":11},{"$error":"#N/A"}]
[{"$nulls":11},{"$error":"#N/A"}]
[{"$nulls":11},{"$error":"#N/A"}]
[{"$nulls":11},{"$error":"#N/A"}]
[{"$nulls":11},{"$error":"#N/A"}]
[{"$nulls":11},{"$error":"#N/A"}]
[{"$nulls":11},{"$error":"#N/A"}]
[{"$nulls":11},{"$error":"#N/A"}]
[{"$nulls":11},{"$error":"#N/A"}]
[{"$nulls":11},{"$error":"#N/A"}]
[{"$nulls":11},{"$error":"#N/A"}]
[{"$nulls":11},{"$error":"#N/A"}]
[{"$nulls":11},{"$error":"#N/A"}]
[{"$nulls":11},{"$error":"#N/A"}]
[{"$nulls":11},{"$error":"#N/A"}]
[{"$nulls":11},{"$error":"#N/A"}]
[{"$nulls":11},{"$error":"#N/A"}]
[{"$nulls":11},{"$error":"#N/A"}]
[{"$nulls":11},{"$error":"#N/A"}]
[{"$nulls":11},{"$error":"#N/A"}]
[{"$nulls":11},{"$error":"#N/A"}]
[{"$nulls":11},{"$error":"#N/A"}]
[{"$nulls":11},{"$error":"#N/A"}]
[{"$nulls":11},{"$error":"#N/A"}]
[{"$nulls":11},{"$error":"#N/A"}]
[{"$nulls":11},{"$error":"#N/A"}]
[{"$nulls":11},{"$error":"#N/A"}]
[{"$nulls":11},{"$f":"VLOOKUP(A553,A:J,$L$1,FALSE)","v":{"$error":"#N/A"}}]
[{"$nulls":11},{"$error":"#N/A"}]
[{"$nulls":11},{"$error":"#N/A"}]
[{"$nulls":11},{"$error":"#N/A"}]
[{"$nulls":11},{"$error":"#N/A"}]
[{"$nulls":11},{"$error":"#N/A"}]
[{"$nulls":11},{"$error":"#N/A"}]
[{"$nulls":11},{"$error":"#N/A"}]
[{"$nulls":11},{"$error":"#N/A"}]
[{"$nulls":11},{"$error":"#N/A"}]
[{"$nulls":11},{"$error":"#N/A"}]
[{"$nulls":11},{"$error":"#N/A"}]
[{"$nulls":11},{"$error":"#N/A"}]
[{"$nulls":11},{"$error":"#N/A"}]
[{"$nulls":11},{"$error":"#N/A"}]
[{"$nulls":11},{"$error":"#N/A"}]
[{"$nulls":11},{"$error":"#N/A"}]
[{"$nulls":11},{"$error":"#N/A"}]
[{"$nulls":11},{"$error":"#N/A"}]
[{"$nulls":11},{"$error":"#N/A"}]
[{"$nulls":11},{"$error":"#N/A"}]
[{"$nulls":11},{"$error":"#N/A"}]
[{"$nulls":11},{"$error":"#N/A"}]
[{"$nulls":11},{"$error":"#N/A"}]
[{"$nulls":11},{"$error":"#N/A"}]
[{"$nulls":11},{"$error":"#N/A"}]
[{"$nulls":11},{"$error":"#N/A"}]
[{"$nulls":11},{"$error":"#N/A"}]
[{"$nulls":11},{"$error":"#N/A"}]
[{"$nulls":11},{"$error":"#N/A"}]
[{"$nulls":11},{"$error":"#N/A"}]
[{"$nulls":11},{"$error":"#N/A"}]
[{"$nulls":11},{"$error":"#N/A"}]
[{"$nulls":11},{"$error":"#N/A"}]
[{"$nulls":11},{"$error":"#N/A"}]
[{"$nulls":11},{"$error":"#N/A"}]
[{"$nulls":11},{"$error":"#N/A"}]
[{"$nulls":11},{"$error":"#N/A"}]
[{"$nulls":11},{"$error":"#N/A"}]
[{"$nulls":11},{"$error":"#N/A"}]
[{"$nulls":11},{"$error":"#N/A"}]
[{"$nulls":11},{"$error":"#N/A"}]
[{"$nulls":11},{"$error":"#N/A"}]
[{"$nulls":11},{"$error":"#N/A"}]
[{"$nulls":11},{"$error":"#N/A"}]
[{"$nulls":11},{"$error":"#N/A"}]
[{"$nulls":11},{"$error":"#N/A"}]
[{"$nulls":11},{"$error":"#N/A"}]
[{"$nulls":11},{"$error":"#N/A"}]
[{"$nulls":11},{"$error":"#N/A"}]
[{"$nulls":11},{"$error":"#N/A"}]
[{"$nulls":11},{"$error":"#N/A"}]
[{"$nulls":11},{"$error":"#N/A"}]
[{"$nulls":11},{"$error":"#N/A"}]
[{"$nulls":11},{"$error":"#N/A"}]
[{"$nulls":11},{"$error":"#N/A"}]
[{"$nulls":11},{"$error":"#N/A"}]
[{"$nulls":11},{"$error":"#N/A"}]
[{"$nulls":11},{"$error":"#N/A"}]
[{"$nulls":11},{"$error":"#N/A"}]
[{"$nulls":11},{"$error":"#N/A"}]
[{"$nulls":11},{"$error":"#N/A"}]
[{"$nulls":11},{"$error":"#N/A"}]
[{"$nulls":11},{"$error":"#N/A"}]
[{"$nulls":11},{"$f":"VLOOKUP(A617,A:J,$L$1,FALSE)","v":{"$error":"#N/A"}}]
[{"$nulls":11},{"$error":"#N/A"}]
[{"$nulls":11},{"$error":"#N/A"}]
[{"$nulls":11},{"$error":"#N/A"}]
[{"$nulls":11},{"$error":"#N/A"}]
[{"$nulls":11},{"$error":"#N/A"}]
[{"$nulls":11},{"$error":"#N/A"}]
[{"$nulls":11},{"$error":"#N/A"}]
[{"$nulls":11},{"$error":"#N/A"}]
[{"$nulls":11},{"$error":"#N/A"}]
[{"$nulls":11},{"$error":"#N/A"}]
[{"$nulls":11},{"$error":"#N/A"}]
[{"$nulls":11},{"$error":"#N/A"}]
[{"$nulls":11},{"$error":"#N/A"}]
[{"$nulls":11},{"$error":"#N/A"}]
[{"$nulls":11},{"$error":"#N/A"}]
[{"$nulls":11},{"$error":"#N/A"}]
[{"$nulls":11},{"$error":"#N/A"}]
[{"$nulls":11},{"$error":"#N/A"}]
[{"$nulls":11},{"$error":"#N/A"}]
[{"$nulls":11},{"$error":"#N/A"}]
[{"$nulls":11},{"$error":"#N/A"}]
[{"$nulls":11},{"$error":"#N/A"}]
[{"$nulls":11},{"$error":"#N/A"}]
[{"$nulls":11},{"$error":"#N/A"}]
[{"$nulls":11},{"$error":"#N/A"}]
[{"$nulls":11},{"$error":"#N/A"}]
[{"$nulls":11},{"$error":"#N/A"}]
[{"$nulls":11},{"$error":"#N/A"}]
[{"$nulls":11},{"$error":"#N/A"}]
[{"$nulls":11},{"$error":"#N/A"}]
[{"$nulls":11},{"$error":"#N/A"}]
[{"$nulls":11},{"$error":"#N/A"}]
[{"$nulls":11},{"$error":"#N/A"}]
[{"$nulls":11},{"$error":"#N/A"}]
[{"$nulls":11},{"$error":"#N/A"}]
[{"$nulls":11},{"$error":"#N/A"}]
[{"$nulls":11},{"$error":"#N/A"}]
[{"$nulls":11},{"$error":"#N/A"}]
[{"$nulls":11},{"$error":"#N/A"}]
[{"$nulls":11},{"$error":"#N/A"}]
[{"$nulls":11},{"$error":"#N/A"}]
[{"$nulls":11},{"$error":"#N/A"}]
[{"$nulls":11},{"$error":"#N/A"}]
[{"$nulls":11},{"$error":"#N/A"}]
[{"$nulls":11},{"$error":"#N/A"}]
[{"$nulls":11},{"$error":"#N/A"}]
[{"$nulls":11},{"$error":"#N/A"}]
[{"$nulls":11},{"$error":"#N/A"}]
[{"$nulls":11},{"$error":"#N/A"}]
[{"$nulls":11},{"$error":"#N/A"}]
[{"$nulls":11},{"$error":"#N/A"}]
[{"$nulls":11},{"$error":"#N/A"}]
[{"$nulls":11},{"$error":"#N/A"}]
[{"$nulls":11},{"$error":"#N/A"}]
[{"$nulls":11},{"$error":"#N/A"}]
[{"$nulls":11},{"$error":"#N/A"}]
[{"$nulls":11},{"$error":"#N/A"}]
[{"$nulls":11},{"$error":"#N/A"}]
[{"$nulls":11},{"$error":"#N/A"}]
[{"$nulls":11},{"$error":"#N/A"}]
[{"$nulls":11},{"$error":"#N/A"}]
[{"$nulls":11},{"$error":"#N/A"}]
[{"$nulls":11},{"$error":"#N/A"}]
[{"$nulls":11},{"$f":"VLOOKUP(A681,A:J,$L$1,FALSE)","v":{"$error":"#N/A"}}]
[{"$nulls":11},{"$error":"#N/A"}]
[{"$nulls":11},{"$error":"#N/A"}]
[{"$nulls":11},{"$error":"#N/A"}]
[{"$nulls":11},{"$error":"#N/A"}]
[{"$nulls":11},{"$error":"#N/A"}]
[{"$nulls":11},{"$error":"#N/A"}]
[{"$nulls":11},{"$error":"#N/A"}]
[{"$nulls":11},{"$error":"#N/A"}]
[{"$nulls":11},{"$error":"#N/A"}]
[{"$nulls":11},{"$error":"#N/A"}]
[{"$nulls":11},{"$error":"#N/A"}]
[{"$nulls":11},{"$error":"#N/A"}]
[{"$nulls":11},{"$error":"#N/A"}]
[{"$nulls":11},{"$error":"#N/A"}]
[{"$nulls":11},{"$error":"#N/A"}]
[{"$nulls":11},{"$error":"#N/A"}]
[{"$nulls":11},{"$error":"#N/A"}]
[{"$nulls":11},{"$error":"#N/A"}]
[{"$nulls":11},{"$error":"#N/A"}]
[{"$nulls":11},{"$error":"#N/A"}]
[{"$nulls":11},{"$error":"#N/A"}]
[{"$nulls":11},{"$error":"#N/A"}]
[{"$nulls":11},{"$error":"#N/A"}]
[{"$nulls":11},{"$error":"#N/A"}]
[{"$nulls":11},{"$error":"#N/A"}]
[{"$nulls":11},{"$error":"#N/A"}]
[{"$nulls":11},{"$error":"#N/A"}]
[{"$nulls":11},{"$error":"#N/A"}]
[{"$nulls":11},{"$error":"#N/A"}]
[{"$nulls":11},{"$error":"#N/A"}]
[{"$nulls":11},{"$error":"#N/A"}]
[{"$nulls":11},{"$error":"#N/A"}]
[{"$nulls":11},{"$error":"#N/A"}]
[{"$nulls":11},{"$error":"#N/A"}]
[{"$nulls":11},{"$error":"#N/A"}]
[{"$nulls":11},{"$error":"#N/A"}]
[{"$nulls":11},{"$error":"#N/A"}]
[{"$nulls":11},{"$error":"#N/A"}]
[{"$nulls":11},{"$error":"#N/A"}]
[{"$nulls":11},{"$error":"#N/A"}]
[{"$nulls":11},{"$error":"#N/A"}]
[{"$nulls":11},{"$error":"#N/A"}]
[{"$nulls":11},{"$error":"#N/A"}]
[{"$nulls":11},{"$error":"#N/A"}]
[{"$nulls":11},{"$error":"#N/A"}]
[{"$nulls":11},{"$error":"#N/A"}]
[{"$nulls":11},{"$error":"#N/A"}]
[{"$nulls":11},{"$error":"#N/A"}]
[{"$nulls":11},{"$error":"#N/A"}]
[{"$nulls":11},{"$error":"#N/A"}]
[{"$nulls":11},{"$error":"#N/A"}]
[{"$nulls":11},{"$error":"#N/A"}]
[{"$nulls":11},{"$error":"#N/A"}]
[{"$nulls":11},{"$error":"#N/A"}]
[{"$nulls":11},{"$error":"#N/A"}]
[{"$nulls":11},{"$error":"#N/A"}]
[{"$nulls":11},{"$error":"#N/A"}]
[{"$nulls":11},{"$error":"#N/A"}]
[{"$nulls":11},{"$error":"#N/A"}]
[{"$nulls":11},{"$error":"#N/A"}]
[{"$nulls":11},{"$error":"#N/A"}]
[{"$nulls":11},{"$error":"#N/A"}]
[{"$nulls":11},{"$error":"#N/A"}]
[{"$nulls":11},{"$f":"VLOOKUP(A745,A:J,$L$1,FALSE)","v":{"$error":"#N/A"}}]
[{"$nulls":11},{"$error":"#N/A"}]
[{"$nulls":11},{"$error":"#N/A"}]
[{"$nulls":11},{"$error":"#N/A"}]
[{"$nulls":11},{"$error":"#N/A"}]
[{"$nulls":11},{"$error":"#N/A"}]
[{"$nulls":11},{"$error":"#N/A"}]
[{"$nulls":11},{"$error":"#N/A"}]
[{"$nulls":11},{"$error":"#N/A"}]
[{"$nulls":11},{"$error":"#N/A"}]
[{"$nulls":11},{"$error":"#N/A"}]
[{"$nulls":11},{"$error":"#N/A"}]
[{"$nulls":11},{"$error":"#N/A"}]
[{"$nulls":11},{"$error":"#N/A"}]
[{"$nulls":11},{"$error":"#N/A"}]
[{"$nulls":11},{"$error":"#N/A"}]
[{"$nulls":11},{"$error":"#N/A"}]
[{"$nulls":11},{"$error":"#N/A"}]
[{"$nulls":11},{"$error":"#N/A"}]
[{"$nulls":11},{"$error":"#N/A"}]
[{"$nulls":11},{"$error":"#N/A"}]
[{"$nulls":11},{"$error":"#N/A"}]
[{"$nulls":11},{"$error":"#N/A"}]
[{"$nulls":11},{"$error":"#N/A"}]
[{"$nulls":11},{"$error":"#N/A"}]
[{"$nulls":11},{"$error":"#N/A"}]
[{"$nulls":11},{"$error":"#N/A"}]
[{"$nulls":11},{"$error":"#N/A"}]
[{"$nulls":11},{"$error":"#N/A"}]
[{"$nulls":11},{"$error":"#N/A"}]
[{"$nulls":11},{"$error":"#N/A"}]
[{"$nulls":11},{"$error":"#N/A"}]
[{"$nulls":11},{"$error":"#N/A"}]
[{"$nulls":11},{"$error":"#N/A"}]
[{"$nulls":11},{"$error":"#N/A"}]
[{"$nulls":11},{"$error":"#N/A"}]
[{"$nulls":11},{"$error":"#N/A"}]
[{"$nulls":11},{"$error":"#N/A"}]
[{"$nulls":11},{"$error":"#N/A"}]
[{"$nulls":11},{"$error":"#N/A"}]
[{"$nulls":11},{"$error":"#N/A"}]
[{"$nulls":11},{"$error":"#N/A"}]
[{"$nulls":11},{"$error":"#N/A"}]
[{"$nulls":11},{"$error":"#N/A"}]
[{"$nulls":11},{"$error":"#N/A"}]
[{"$nulls":11},{"$error":"#N/A"}]
[{"$nulls":11},{"$error":"#N/A"}]
[{"$nulls":11},{"$error":"#N/A"}]
[{"$nulls":11},{"$error":"#N/A"}]
[{"$nulls":11},{"$error":"#N/A"}]
[{"$nulls":11},{"$error":"#N/A"}]
[{"$nulls":11},{"$error":"#N/A"}]
[{"$nulls":11},{"$error":"#N/A"}]
[{"$nulls":11},{"$error":"#N/A"}]
[{"$nulls":11},{"$error":"#N/A"}]
[{"$nulls":11},{"$error":"#N/A"}]
[{"$nulls":11},{"$error":"#N/A"}]
[{"$nulls":11},{"$error":"#N/A"}]
[{"$nulls":11},{"$error":"#N/A"}]
[{"$nulls":11},{"$error":"#N/A"}]
[{"$nulls":11},{"$error":"#N/A"}]
[{"$nulls":11},{"$error":"#N/A"}]
[{"$nulls":11},{"$error":"#N/A"}]
[{"$nulls":11},{"$error":"#N/A"}]
[{"$nulls":11},{"$f":"VLOOKUP(A809,A:J,$L$1,FALSE)","v":{"$error":"#N/A"}}]
[{"$nulls":11},{"$error":"#N/A"}]
[{"$nulls":11},{"$error":"#N/A"}]
[{"$nulls":11},{"$error":"#N/A"}]
[{"$nulls":11},{"$error":"#N/A"}]
[{"$nulls":11},{"$error":"#N/A"}]
[{"$nulls":11},{"$error":"#N/A"}]
[{"$nulls":11},{"$error":"#N/A"}]
[{"$nulls":11},{"$error":"#N/A"}]
[{"$nulls":11},{"$error":"#N/A"}]
[{"$nulls":11},{"$error":"#N/A"}]
[{"$nulls":11},{"$error":"#N/A"}]
[{"$nulls":11},{"$error":"#N/A"}]
[{"$nulls":11},{"$error":"#N/A"}]
[{"$nulls":11},{"$error":"#N/A"}]
[{"$nulls":11},{"$error":"#N/A"}]
[{"$nulls":11},{"$error":"#N/A"}]
[{"$nulls":11},{"$error":"#N/A"}]
[{"$nulls":11},{"$error":"#N/A"}]
[{"$nulls":11},{"$error":"#N/A"}]
[{"$nulls":11},{"$error":"#N/A"}]
[{"$nulls":11},{"$error":"#N/A"}]
[{"$nulls":11},{"$error":"#N/A"}]
[{"$nulls":11},{"$error":"#N/A"}]
[{"$nulls":11},{"$error":"#N/A"}]
[{"$nulls":11},{"$error":"#N/A"}]
[{"$nulls":11},{"$error":"#N/A"}]
[{"$nulls":11},{"$error":"#N/A"}]
[{"$nulls":11},{"$error":"#N/A"}]
[{"$nulls":11},{"$error":"#N/A"}]
[{"$nulls":11},{"$error":"#N/A"}]
[{"$nulls":11},{"$error":"#N/A"}]
[{"$nulls":11},{"$error":"#N/A"}]
[{"$nulls":11},{"$error":"#N/A"}]
[{"$nulls":11},{"$error":"#N/A"}]
[{"$nulls":11},{"$error":"#N/A"}]
[{"$nulls":11},{"$error":"#N/A"}]

{"sheet":"Erklärung Produktnachweise","index":5,"n_rows":62,"n_cols":45,"rows_kept":62,"merged":[[0,0,1,12],[0,13,0,19],[0,20,0,27],[0,28,0,30],[0,31,0,33],[0,34,0,36],[0,37,0,39],[0,45,1,52],[1,13,1,19],[1,20,1,39],[2,0,2,13],[2,14,2,26],[2,27,2,39],[3,0,3,6],[3,7,3,13],[3,14,3,20],[3,21,3,26],[3,27,4,33],[3,34,4,39],[4,0,4,6],[4,7,4,13],[4,14,4,20],[4,21,4,26],[5,0,5,6],[5,7,5,13],[5,14,5,20],[5,21,5,26],[5,27,5,33],[5,34,5,39],[6,0,6,6],[6,7,6,13],[6,14,6,20],[6,21,6,26],[6,27,6,33],[6,34,6,39],[7,0,7,6],[7,7,7,13],[7,14,7,20],[7,21,7,26],[7,27,7,33],[7,34,7,39],[8,0,8,6],[8,7,8,13],[8,14,8,20],[8,21,8,26],[8,27,8,33],[8,34,8,39],[9,0,9,6],[9,7,9,13],[9,14,9,20],[9,21,9,26],[9,27,9,33],[9,34,9,39],[10,0,10,6],[10,7,10,13],[10,14,10,20],[10,21,10,26],[10,27,10,33],[10,34,10,39],[11,0,11,13],[12,0,12,2],[12,3,12,4],[12,5,12,13],[12,14,12,15],[12,16,12,17],[12,18,12,26],[12,27,12,28],[12,29,12,30],[12,31,12,39],[13,0,13,2],[13,3,13,4],[13,5,13,13],[13,14,13,15],[13,16,13,17],[13,18,13,26],[13,27,13,28],[13,29,13,30],[13,31,13,39],[14,0,14,2],[14,3,14,4],[14,5,14,13],[14,14,14,15],[14,16,14,17],[14,18,14,26],[14,27,14,28],[14,29,14,30],[14,31,14,39],[15,0,15,2],[15,3,15,4],[15,5,15,13],[15,14,15,15],[15,16,15,17],[15,18,15,26],[15,27,15,28],[15,29,15,30],[15,31,15,39],[16,0,16,2],[16,3,16,4],[16,5,16,13],[16,14,16,15],[16,16,16,17],[16,18,16,26],[16,27,16,28],[16,29,16,30],[16,31,16,39],[17,0,18,3],[17,4,17,15],[17,16,17,25],[17,26,18,27],[17,28,18,39],[18,4,18,8],[18,9,18,12],[18,13,18,15],[18,16,18,17],[18,18,18,19],[18,20,18,21],[18,22,18,23],[18,24,18,25],[19,0,19,3],[19,4,19,8],[19,9,19,12],[19,13,19,15],[19,16,19,17],[19,18,19,19],[19,20,19,21],[19,22,19,23],[19,24,19,25],[19,26,19,27],[19,28,19,39],[20,0,20,3],[20,4,20,8],[20,9,20,12],[20,13,20,15],[20,16,20,17],[20,18,20,19],[20,20,20,21],[20,22,20,23],[20,24,20,25],[20,26,20,27],[20,28,20,39],[21,0,21,3],[21,4,21,8],[21,9,21,12],[21,13,21,15],[21,16,21,17],[21,18,21,19],[21,20,21,21],[21,22,21,23],[21,24,21,25],[21,26,21,27],[21,28,21,39],[22,0,22,3],[22,4,22,8],[22,9,22,12],[22,13,22,15],[22,16,22,17],[22,18,22,19],[22,20,22,21],[22,22,22,23],[22,24,22,25],[22,26,22,27],[22,28,22,39],[23,0,23,3],[23,4,23,8],[23,9,23,12],[23,13,23,15],[23,16,23,17],[23,18,23,19],[23,20,23,21],[23,22,23,23],[23,24,23,25],[23,26,23,27],[23,28,23,39],[24,0,24,3],[24,4,24,8],[24,9,24,12],[24,13,24,15],[24,16,24,17],[24,18,24,19],[24,20,24,21],[24,22,24,23],[24,24,24,25],[24,26,24,27],[24,28,24,39],[25,0,25,3],[25,4,25,8],[25,9,25,12],[25,13,25,15],[25,16,25,17],[25,18,25,19],[25,20,25,21],[25,22,25,23],[25,24,25,25],[25,26,25,27],[25,28,25,39],[26,0,26,3],[26,4,26,8],[26,9,26,12],[26,13,26,15],[26,16,26,17],[26,18,26,19],[26,20,26,21],[26,22,26,23],[26,24,26,25],[26,26,26,27],[26,28,26,39],[27,0,27,3],[27,4,27,8],[27,9,27,12],[27,13,27,15],[27,16,27,17],[27,18,27,19],[27,20,27,21],[27,22,27,23],[27,24,27,25],[27,26,27,27],[27,28,27,39],[28,0,28,3],[28,4,28,8],[28,9,28,12],[28,13,28,15],[28,16,28,17],[28,18,28,19],[28,20,28,21],[28,22,28,23],[28,24,28,25],[28,26,28,27],[28,28,28,39],[29,0,29,3],[29,4,29,8],[29,9,29,12],[29,13,29,15],[29,16,29,17],[29,18,29,19],[29,20,29,21],[29,22,29,23],[29,24,29,25],[29,26,29,27],[29,28,29,39],[30,0,30,3],[30,4,30,8],[30,9,30,12],[30,13,30,15],[30,16,30,17],[30,18,30,19],[30,20,30,21],[30,22,30,23],[30,24,30,25],[30,26,30,27],[30,28,30,39],[31,0,31,3],[31,4,31,8],[31,9,31,12],[31,13,31,15],[31,16,31,17],[31,18,31,19],[31,20,31,21],[31,22,31,23],[31,24,31,25],[31,26,31,27],[31,28,31,39],[32,0,32,3],[32,4,32,8],[32,9,32,12],[32,13,32,15],[32,16,32,17],[32,18,32,19],[32,20,32,21],[32,22,32,23],[32,24,32,25],[32,26,32,27],[32,28,32,39],[33,0,33,3],[33,4,33,8],[33,9,33,12],[33,13,33,15],[33,16,33,17],[33,18,33,19],[33,20,33,21],[33,22,33,23],[33,24,33,25],[33,26,33,27],[33,28,33,39],[34,0,34,3],[34,4,34,8],[34,9,34,12],[34,13,34,15],[34,16,34,17],[34,18,34,19],[34,20,34,21],[34,22,34,23],[34,24,34,25],[34,26,34,27],[34,28,34,39],[35,0,35,3],[35,4,35,8],[35,9,35,12],[35,13,35,15],[35,16,35,17],[35,18,35,19],[35,20,35,21],[35,22,35,23],[35,24,35,25],[35,26,35,27],[35,28,35,39],[36,0,36,3],[36,4,36,8],[36,9,36,12],[36,13,36,15],[36,16,36,17],[36,18,36,19],[36,20,36,21],[36,22,36,23],[36,24,36,25],[36,26,36,27],[36,28,36,39],[37,0,37,3],[37,4,37,8],[37,9,37,12],[37,13,37,15],[37,16,37,17],[37,18,37,19],[37,20,37,21],[37,22,37,23],[37,24,37,25],[37,26,37,27],[37,28,37,39],[38,0,38,3],[38,4,38,8],[38,9,38,12],[38,13,38,15],[38,16,38,17],[38,18,38,19],[38,20,38,21],[38,22,38,23],[38,24,38,25],[38,26,38,27],[38,28,38,39],[39,0,39,3],[39,4,39,8],[39,9,39,12],[39,13,39,15],[39,16,39,17],[39,18,39,19],[39,20,39,21],[39,22,39,23],[39,24,39,25],[39,26,39,27],[39,28,39,39],[40,0,40,3],[40,4,40,8],[40,9,40,12],[40,13,40,15],[40,16,40,17],[40,18,40,19],[40,20,40,21],[40,22,40,23],[40,24,40,25],[40,26,40,27],[40,28,40,39],[41,0,41,3],[41,4,41,8],[41,9,41,12],[41,13,41,15],[41,16,41,17],[41,18,41,19],[41,20,41,21],[41,22,41,23],[41,24,41,25],[41,26,41,27],[41,28,41,39],[42,0,42,3],[42,4,42,8],[42,9,42,12],[42,13,42,15],[42,16,42,17],[42,18,42,19],[42,20,42,21],[42,22,42,23],[42,24,42,25],[42,26,42,27],[42,28,42,39],[43,0,43,3],[43,4,43,8],[43,9,43,12],[43,13,43,15],[43,16,43,17],[43,18,43,19],[43,20,43,21],[43,22,43,23],[43,24,43,25],[43,26,43,27],[43,28,43,39],[44,0,44,3],[44,4,44,8],[44,9,44,12],[44,13,44,15],[44,16,44,17],[44,18,44,19],[44,20,44,21],[44,22,44,23],[44,24,44,25],[44,26,44,27],[44,28,44,39],[45,0,45,3],[45,4,45,8],[45,9,45,12],[45,13,45,15],[45,16,45,17],[45,18,45,19],[45,20,45,21],[45,22,45,23],[45,24,45,25],[45,26,45,27],[45,28,45,39],[46,0,46,3],[46,4,46,8],[46,9,46,12],[46,13,46,15],[46,16,46,17],[46,18,46,19],[46,20,46,21],[46,22,46,23],[46,24,46,25],[46,26,46,27],[46,28,46,39],[47,0,47,3],[47,4,47,8],[47,9,47,12],[47,13,47,15],[47,16,47,17],[47,18,47,19],[47,20,47,21],[47,22,47,23],[47,24,47,25],[47,26,47,27],[47,28,47,39],[48,0,48,3],[48,4,48,8],[48,9,48,12],[48,13,48,15],[48,16,48,17],[48,18,48,19],[48,20,48,21],[48,22,48,23],[48,24,48,25],[48,26,48,27],[48,28,48,39],[49,0,49,3],[49,4,49,8],[49,9,49,12],[49,13,49,15],[49,16,49,17],[49,18,49,19],[49,20,49,21],[49,22,49,23],[49,24,49,25],[49,26,49,27],[49,28,49,39],[50,0,50,3],[50,4,50,15],[50,16,50,25],[50,26,50,27],[50,28,50,39],[51,0,51,3],[51,4,51,15],[51,16,51,25],[51,26,51,27],[51,28,51,39],[52,0,52,3],[52,4,52,15],[52,16,52,25],[52,26,52,27],[52,28,52,39],[53,0,53,3],[53,4,53,15],[53,16,53,25],[53,26,53,27],[53,28,53,39],[54,0,54,3],[54,4,54,8],[54,9,54,12],[54,13,54,15],[54,16,54,17],[54,18,54,19],[54,20,54,21],[54,22,54,23],[54,24,54,25],[54,26,54,27],[54,28,54,39],[55,0,55,3],[55,4,55,8],[55,9,55,12],[55,13,55,15],[55,16,55,17],[55,18,55,19],[55,20,55,21],[55,22,55,23],[55,24,55,25],[55,26,55,27],[55,28,55,39],[56,0,56,39],[57,0,57,7],[57,8,57,20],[57,21,60,22],[57,26,60,39],[58,0,58,7],[58,8,58,20],[59,0,59,7],[59,8,59,20],[60,0,60,7],[60,8,60,20],[61,0,61,7],[61,8,61,20],[61,21,61,22],[61,26,61,39]]}
[{"$f":"Sprachen!L271","v":"Produktbezogene Nachweise"},{"$nulls":12},{"$f":"Sprachen!L378","v":"Bericht"},{"$nulls":6},{"$f":"IF(H4<>\"\",H4&\" / \"&H5,\"\")","v":""},{"$nulls":7},{"$f":"Sprachen!L88","v":"Blatt"},{"$nulls":5},{"$f":"Sprachen!L364","v":"von"},{"$nulls":6},"Sprachauswahl"]
[{"$nulls":13},{"$f":"Sprachen!L255","v":"Organisation"},{"$nulls":6},{"$f":"IF('Deckblatt '!U2<>\"\",'Deckblatt '!U2,\"\")","v":""},{"$nulls":20},{"$f":"'PPF-Bewertung'!AP3","v":"Deutsch"}]
[{"$f":"Sprachen!L46","v":"Angaben zur Organisation"},{"$nulls":13},{"$f":"Sprachen!L44","v":"Angaben zu Mustern"},{"$nulls":12},{"$f":"Sprachen!L45","v":"Angaben zum Kunden"}]
[{"$f":"Sprachen!L75","v":"Berichtsnummer"},{"$nulls":6},{"$f":"IF('Deckblatt '!H16<>\"\",'Deckblatt '!H16,\"\")","v":""},{"$nulls":6},{"$f":"Sprachen!L198","v":"Lieferscheinnummer"},{"$nulls":6},{"$f":"IF('Deckblatt '!V16<>\"\",'Deckblatt '!V16,\"\")","v":""},{"$nulls":5},{"$f":"Sprachen!L187","v":"Kunde"},{"$nulls":6},{"$f":"IF('Deckblatt '!A10<>\"\",'Deckblatt '!A10,\"\")","v":""}]
[{"$f":"Sprachen!L77","v":"Berichtsversion"},{"$nulls":6},{"$f":"IF('Deckblatt '!H17<>\"\",'Deckblatt '!H17,\"\")","v":""},{"$nulls":6},{"$f":"Sprachen!L197","v":"Liefermenge"},{"$nulls":6},{"$f":"IF('Deckblatt '!V17<>\"\",'Deckblatt '!V17,\"\")","v":""}]
[{"$f":"Sprachen!L199","v":"Lieferstandort"},{"$nulls":6},{"$f":"IF('Deckblatt '!H18<>\"\",'Deckblatt '!H18,\"\")","v":""},{"$nulls":6},{"$f":"Sprachen!L89","v":"Chargennummer"},{"$nulls":6},{"$f":"IF('Deckblatt '!V18<>\"\",'Deckblatt '!V18,\"\")","v":""},{"$nulls":5},{"$f":"Sprachen!L87","v":"Bestellnr. PPF-Muster"},{"$nulls":6},{"$f":"IF('Deckblatt '!AI18<>\"\",'Deckblatt '!AI18,\"\")","v":""}]
[{"$f":"Sprachen!L276","v":"Produktionsstandort"},{"$nulls":6},{"$f":"IF('Deckblatt '!H19<>\"\",'Deckblatt '!H19,\"\")","v":""},{"$nulls":6},{"$f":"Sprachen!L217","v":"Mustergewicht [kg]"},{"$nulls":6},{"$f":"IF('Deckblatt '!V19<>\"\",'Deckblatt '!V19,\"\")","v":""},{"$nulls":5},{"$f":"Sprachen!L14","v":"Abladestelle"},{"$nulls":6},{"$f":"IF('Deckblatt '!AI19<>\"\",'Deckblatt '!AI19,\"\")","v":""}]
[{"$f":"Sprachen!L304","v":"Sachnummer"},{"$nulls":6},{"$f":"IF('Deckblatt '!H20<>\"\",'Deckblatt '!H20,\"\")","v":""},{"$nulls":6},{"$f":"Sprachen!L166","v":"Hardwarestand"},{"$nulls":6},{"$f":"IF('Deckblatt '!V20<>\"\",'Deckblatt '!V20,\"\")","v":""},{"$nulls":5},{"$f":"Sprachen!L304","v":"Sachnummer"},{"$nulls":6},{"$f":"IF('Deckblatt '!AI20<>\"\",'Deckblatt '!AI20,\"\")","v":""}]
[{"$f":"Sprachen!L65","v":"Benennung"},{"$nulls":6},{"$f":"IF('Deckblatt '!H21<>\"\",'Deckblatt '!H21,\"\")","v":""},{"$nulls":6},{"$f":"Sprachen!L98","v":"Diagnosestand"},{"$nulls":6},{"$f":"IF('Deckblatt '!V21<>\"\",'Deckblatt '!V21,\"\")","v":""},{"$nulls":5},{"$f":"Sprachen!L65","v":"Benennung"},{"$nulls":6},{"$f":"IF('Deckblatt '!AI21<>\"\",'Deckblatt '!AI21,\"\")","v":""}]
[{"$f":"Sprachen!L374","v":"Zeichnungsnummer"},{"$nulls":6},{"$f":"IF('Deckblatt '!H22<>\"\",'Deckblatt '!H22,\"\")","v":""},{"$nulls":6},{"$f":"Sprachen!L326","v":"Softwarestand"},{"$nulls":6},{"$f":"IF('Deckblatt '!V22<>\"\",'Deckblatt '!V22,\"\")","v":""},{"$nulls":5},{"$f":"Sprachen!L374","v":"Zeichnungsnummer"},{"$nulls":6},{"$f":"IF('Deckblatt '!AI22<>\"\",'Deckblatt '!AI22,\"\")","v":""}]
[{"$f":"Sprachen!L361","v":"Version/ Datum"},{"$nulls":6},{"$f":"IF('Deckblatt '!H23<>\"\",'Deckblatt '!H23,\"\")","v":""},{"$nulls":6},{"$f":"Sprachen!L177","v":"Kennung/DUNS"},{"$nulls":6},{"$f":"IF('Deckblatt '!V23<>\"\",'Deckblatt '!V23,\"\")","v":""},{"$nulls":5},{"$f":"Sprachen!L361","v":"Version/ Datum"},{"$nulls":6},{"$f":"IF('Deckblatt '!AI23<>\"\",'Deckblatt '!AI23,\"\")","v":""}]
[{"$f":"IF('Deckblatt '!A24:N24<>\"\",'Deckblatt '!A24:N24,\"\")","v":"-"}]
[{"$f":"IF('PPF-Bewertung'!M29=\"ja\",\"x\",IF('PPF-Bewertung'!M29=\"yes\",\"x\",\"\"))","v":""},null,null,"3.1",{"$nulls":10},{"$f":"IF('PPF-Bewertung'!M33=\"ja\",\"x\",IF('PPF-Bewertung'!M33=\"yes\",\"x\",\"\"))","v":""},null,"3.5",null,{"$f":"Sprachen!L27","v":"Akustik"},{"$nulls":8},{"$f":"IF('PPF-Bewertung'!M37=\"ja\",\"x\",IF('PPF-Bewertung'!M37=\"yes\",\"x\",\"\"))","v":""},null,"3.9",null,{"$f":"Sprachen!L333","v":"Technische Sauberkeit"}]
[{"$f":"IF('PPF-Bewertung'!M30=\"ja\",\"x\",IF('PPF-Bewertung'!M30=\"yes\",\"x\",\"\"))","v":""},null,null,"3.2",null,{"$f":"Sprachen!L367","v":"Werkstoff"},{"$nulls":8},{"$f":"IF('PPF-Bewertung'!M34=\"ja\",\"x\",IF('PPF-Bewertung'!M34=\"yes\",\"x\",\"\"))","v":""},null,"3.6",null,{"$f":"Sprachen!L154","v":"Geruch"},{"$nulls":8},{"$f":"IF('PPF-Bewertung'!M38=\"ja\",\"x\",IF('PPF-Bewertung'!M38=\"yes\",\"x\",\"\"))","v":""},null,"3.10",null,{"$f":"Sprachen!L377","v":"Zuverlässigkeit"},{"$nulls":12}," "]
[{"$f":"IF('PPF-Bewertung'!M31=\"ja\",\"x\",IF('PPF-Bewertung'!M31=\"yes\",\"x\",\"\"))","v":""},null,null,"3.3",null,{"$f":"Sprachen!L144","v":"Funktion"},{"$nulls":8},{"$f":"IF('PPF-Bewertung'!M35=\"ja\",\"x\",IF('PPF-Bewertung'!M35=\"yes\",\"x\",\"\"))","v":""},null,"3.7",null,{"$f":"Sprachen!L56","v":"Aussehen"},{"$nulls":8},{"$f":"IF('PPF-Bewertung'!M39=\"ja\",\"x\",IF('PPF-Bewertung'!M39=\"yes\",\"x\",\"\"))","v":""},null,"3.11",null,{"$f":"Sprachen!L82","v":"Beständigkeit gegenüber Electrostatic Discharge (ESD) "}]
[{"$f":"IF('PPF-Bewertung'!M32=\"ja\",\"x\",IF('PPF-Bewertung'!M32=\"yes\",\"x\",\"\"))","v":""},null,null,"3.4",null,{"$f":"Sprachen!L161","v":"Haptik"},{"$nulls":8},{"$f":"IF('PPF-Bewertung'!M36=\"ja\",\"x\",IF('PPF-Bewertung'!M36=\"yes\",\"x\",\"\"))","v":""},null,"3.8",null,{"$f":"Sprachen!L252","v":"Oberflächenanforderung"},{"$nulls":8},{"$f":"IF('PPF-Bewertung'!M40=\"ja\",\"x\",IF('PPF-Bewertung'!M40=\"yes\",\"x\",\"\"))","v":""},null,"3.12",null,{"$f":"Sprachen!L117","v":"Elektrische Sicherheit / Hochvolt-Sicherheit"}]
[{"$nulls":27},{"$f":"IF('PPF-Bewertung'!M41=\"ja\",\"x\",IF('PPF-Bewertung'!M41=\"yes\",\"x\",\"\"))","v":""},null,"3.13",null,{"$f":"Sprachen!L118","v":"Elektromagnetische Verträglichkeit (EMV)"}]
[{"$f":"Sprachen!L248","v":"Nr."},{"$nulls":3},{"$f":"Sprachen!L41","v":"Anforderungen/\nSpezifikation"},{"$nulls":11},{"$f":"Sprachen!L171","v":"IST-Werte Organisation"},{"$nulls":9},{"$f":"Sprachen!L328","v":"Spezifikation erfüllt"},null,{"$f":"Sprachen!L61","v":"Bemerkung"}]
[{"$nulls":4},{"$f":"Sprachen!L475","v":"Sollwert"},{"$nulls":4},{"$f":"Sprachen!L476","v":"untere Toleranz"},{"$nulls":3},{"$f":"Sprachen!L477","v":"obere Toleranz"},null,null,1,null,2,null,3,null,4,null,5]
[{"$f":"Sprachen!L479","v":"Bitte Positionsnummer mit Lagebezeichnung links oder rechts oder oben oder unten usw. einfügen."},{"$nulls":3},{"$f":"Sprachen!L480","v":"Bitte nur den Sollwert ohne Angabe der Maßeinheit, wie mm, Grad usw. eintragen."},{"$nulls":4},{"$f":"Sprachen!L481","v":"Bitte nur die untere Toleranz mit Vorzeichen -(Minus) ohne Angabe der Maßeinheit, wie mm, Grad usw. eintragen."},{"$nulls":3},{"$f":"Sprachen!L482","v":"Bitte nur die obere Toleranz ohne Angabe der Maßeinheit, wie mm, Grad usw. eintragen."},null,null,{"$f":"Sprachen!$L483","v":"Bitte nur den gemessenen Wert ohne Angabe der Maßeinheit, wie mm, Grad usw. eintragen."},null,{"$f":"Sprachen!$L483","v":"Bitte nur den gemessenen Wert ohne Angabe der Maßeinheit, wie mm, Grad usw. eintragen."},null,{"$f":"Sprachen!$L483","v":"Bitte nur den gemessenen Wert ohne Angabe der Maßeinheit, wie mm, Grad usw. eintragen."},null,{"$f":"Sprachen!$L483","v":"Bitte nur den gemessenen Wert ohne Angabe der Maßeinheit, wie mm, Grad usw. eintragen."},null,{"$f":"Sprachen!$L483","v":"Bitte nur den gemessenen Wert ohne Angabe der Maßeinheit, wie mm, Grad usw. eintragen."}]
{"$rows_empty":30}
[{"$nulls":4},{"$f":"Sprachen!L478","v":"Dieses Feld ist reserviert für Bemerkungen und Texte in der Zeichnung."},{"$nulls":11},{"$f":"Sprachen!L478","v":"Dieses Feld ist reserviert für Bemerkungen und Texte in der Zeichnung."}]
[{"$nulls":4},{"$f":"Sprachen!L478","v":"Dieses Feld ist reserviert für Bemerkungen und Texte in der Zeichnung."},{"$nulls":11},{"$f":"Sprachen!L478","v":"Dieses Feld ist reserviert für Bemerkungen und Texte in der Zeichnung."}]
[{"$nulls":4},{"$f":"Sprachen!L478","v":"Dieses Feld ist reserviert für Bemerkungen und Texte in der Zeichnung."},{"$nulls":11},{"$f":"Sprachen!L478","v":"Dieses Feld ist reserviert für Bemerkungen und Texte in der Zeichnung."}]
[{"$nulls":4},{"$f":"Sprachen!L478","v":"Dieses Feld ist reserviert für Bemerkungen und Texte in der Zeichnung."},{"$nulls":11},{"$f":"Sprachen!L478","v":"Dieses Feld ist reserviert für Bemerkungen und Texte in der Zeichnung."}]
[]
[]
[{"$f":"Sprachen!L84","v":"Bestätigung Organisation"}]
[{"$f":"Sprachen!L234","v":"Name"},{"$nulls":20},{"$f":"Sprachen!L61","v":"Bemerkung"}]
[{"$f":"Sprachen!L20","v":"Abteilung"}]
[{"$f":"Sprachen!L343","v":"Telefon"}]
[{"$f":"Sprachen!L119","v":"E-Mail/Fax-Nr."}]
[{"$f":"Sprachen!L91","v":"Datum"},{"$nulls":20},{"$f":"Sprachen!L348","v":"Unterschrift"}]

{"sheet":"Produktbez. Nachweise ","index":6,"n_rows":62,"n_cols":45,"rows_kept":62,"merged":[[0,0,1,12],[0,13,0,19],[0,20,0,27],[0,28,0,30],[0,31,0,33],[0,34,0,36],[0,37,0,39],[0,45,1,52],[1,13,1,19],[1,20,1,39],[2,0,2,13],[2,14,2,26],[2,27,2,39],[3,0,3,6],[3,7,3,13],[3,14,3,20],[3,21,3,26],[3,27,4,33],[3,34,4,39],[4,0,4,6],[4,7,4,13],[4,14,4,20],[4,21,4,26],[5,0,5,6],[5,7,5,13],[5,14,5,20],[5,21,5,26],[5,27,5,33],[5,34,5,39],[6,0,6,6],[6,7,6,13],[6,14,6,20],[6,21,6,26],[6,27,6,33],[6,34,6,39],[7,0,7,6],[7,7,7,13],[7,14,7,20],[7,21,7,26],[7,27,7,33],[7,34,7,39],[8,0,8,6],[8,7,8,13],[8,14,8,20],[8,21,8,26],[8,27,8,33],[8,34,8,39],[9,0,9,6],[9,7,9,13],[9,14,9,20],[9,21,9,26],[9,27,9,33],[9,34,9,39],[10,0,10,6],[10,7,10,13],[10,14,10,20],[10,21,10,26],[10,27,10,33],[10,34,10,39],[11,0,11,13],[12,0,12,2],[12,3,12,4],[12,5,12,13],[12,14,12,15],[12,16,12,17],[12,18,12,26],[12,27,12,28],[12,29,12,30],[12,31,12,39],[13,0,13,2],[13,3,13,4],[13,5,13,13],[13,14,13,15],[13,16,13,17],[13,18,13,26],[13,27,13,28],[13,29,13,30],[13,31,13,39],[14,0,14,2],[14,3,14,4],[14,5,14,13],[14,14,14,15],[14,16,14,17],[14,18,14,26],[14,27,14,28],[14,29,14,30],[14,31,14,39],[15,0,15,2],[15,3,15,4],[15,5,15,13],[15,14,15,15],[15,16,15,17],[15,18,15,26],[15,27,15,28],[15,29,15,30],[15,31,15,39],[16,0,16,2],[16,3,16,4],[16,5,16,13],[16,14,16,15],[16,16,16,17],[16,18,16,26],[16,27,16,28],[16,29,16,30],[16,31,16,39],[17,0,18,3],[17,4,17,15],[17,16,17,25],[17,26,18,27],[17,28,18,39],[18,4,18,8],[18,9,18,12],[18,13,18,15],[18,16,18,17],[18,18,18,19],[18,20,18,21],[18,22,18,23],[18,24,18,25],[19,0,19,3],[19,4,19,8],[19,9,19,12],[19,13,19,15],[19,16,19,17],[19,18,19,19],[19,20,19,21],[19,22,19,23],[19,24,19,25],[19,26,19,27],[19,28,19,39],[20,0,20,3],[20,4,20,8],[20,9,20,12],[20,13,20,15],[20,16,20,17],[20,18,20,19],[20,20,20,21],[20,22,20,23],[20,24,20,25],[20,26,20,27],[20,28,20,39],[21,0,21,3],[21,4,21,8],[21,9,21,12],[21,13,21,15],[21,16,21,17],[21,18,21,19],[21,20,21,21],[21,22,21,23],[21,24,21,25],[21,26,21,27],[21,28,21,39],[22,0,22,3],[22,4,22,8],[22,9,22,12],[22,13,22,15],[22,16,22,17],[22,18,22,19],[22,20,22,21],[22,22,22,23],[22,24,22,25],[22,26,22,27],[22,28,22,39],[23,0,23,3],[23,4,23,8],[23,9,23,12],[23,13,23,15],[23,16,23,17],[23,18,23,19],[23,20,23,21],[23,22,23,23],[23,24,23,25],[23,26,23,27],[23,28,23,39],[24,0,24,3],[24,4,24,8],[24,9,24,12],[24,13,24,15],[24,16,24,17],[24,18,24,19],[24,20,24,21],[24,22,24,23],[24,24,24,25],[24,26,24,27],[24,28,24,39],[25,0,25,3],[25,4,25,8],[25,9,25,12],[25,13,25,15],[25,16,25,17],[25,18,25,19],[25,20,25,21],[25,22,25,23],[25,24,25,25],[25,26,25,27],[25,28,25,39],[26,0,26,3],[26,4,26,8],[26,9,26,12],[26,13,26,15],[26,16,26,17],[26,18,26,19],[26,20,26,21],[26,22,26,23],[26,24,26,25],[26,26,26,27],[26,28,26,39],[27,0,27,3],[27,4,27,8],[27,9,27,12],[27,13,27,15],[27,16,27,17],[27,18,27,19],[27,20,27,21],[27,22,27,23],[27,24,27,25],[27,26,27,27],[27,28,27,39],[28,0,28,3],[28,4,28,8],[28,9,28,12],[28,13,28,15],[28,16,28,17],[28,18,28,19],[28,20,28,21],[28,22,28,23],[28,24,28,25],[28,26,28,27],[28,28,28,39],[29,0,29,3],[29,4,29,8],[29,9,29,12],[29,13,29,15],[29,16,29,17],[29,18,29,19],[29,20,29,21],[29,22,29,23],[29,24,29,25],[29,26,29,27],[29,28,29,39],[30,0,30,3],[30,4,30,8],[30,9,30,12],[30,13,30,15],[30,16,30,17],[30,18,30,19],[30,20,30,21],[30,22,30,23],[30,24,30,25],[30,26,30,27],[30,28,30,39],[31,0,31,3],[31,4,31,8],[31,9,31,12],[31,13,31,15],[31,16,31,17],[31,18,31,19],[31,20,31,21],[31,22,31,23],[31,24,31,25],[31,26,31,27],[31,28,31,39],[32,0,32,3],[32,4,32,8],[32,9,32,12],[32,13,32,15],[32,16,32,17],[32,18,32,19],[32,20,32,21],[32,22,32,23],[32,24,32,25],[32,26,32,27],[32,28,32,39],[33,0,33,3],[33,4,33,8],[33,9,33,12],[33,13,33,15],[33,16,33,17],[33,18,33,19],[33,20,33,21],[33,22,33,23],[33,24,33,25],[33,26,33,27],[33,28,33,39],[34,0,34,3],[34,4,34,8],[34,9,34,12],[34,13,34,15],[34,16,34,17],[34,18,34,19],[34,20,34,21],[34,22,34,23],[34,24,34,25],[34,26,34,27],[34,28,34,39],[35,0,35,3],[35,4,35,8],[35,9,35,12],[35,13,35,15],[35,16,35,17],[35,18,35,19],[35,20,35,21],[35,22,35,23],[35,24,35,25],[35,26,35,27],[35,28,35,39],[36,0,36,3],[36,4,36,8],[36,9,36,12],[36,13,36,15],[36,16,36,17],[36,18,36,19],[36,20,36,21],[36,22,36,23],[36,24,36,25],[36,26,36,27],[36,28,36,39],[37,0,37,3],[37,4,37,8],[37,9,37,12],[37,13,37,15],[37,16,37,17],[37,18,37,19],[37,20,37,21],[37,22,37,23],[37,24,37,25],[37,26,37,27],[37,28,37,39],[38,0,38,3],[38,4,38,8],[38,9,38,12],[38,13,38,15],[38,16,38,17],[38,18,38,19],[38,20,38,21],[38,22,38,23],[38,24,38,25],[38,26,38,27],[38,28,38,39],[39,0,39,3],[39,4,39,8],[39,9,39,12],[39,13,39,15],[39,16,39,17],[39,18,39,19],[39,20,39,21],[39,22,39,23],[39,24,39,25],[39,26,39,27],[39,28,39,39],[40,0,40,3],[40,4,40,8],[40,9,40,12],[40,13,40,15],[40,16,40,17],[40,18,40,19],[40,20,40,21],[40,22,40,23],[40,24,40,25],[40,26,40,27],[40,28,40,39],[41,0,41,3],[41,4,41,8],[41,9,41,12],[41,13,41,15],[41,16,41,17],[41,18,41,19],[41,20,41,21],[41,22,41,23],[41,24,41,25],[41,26,41,27],[41,28,41,39],[42,0,42,3],[42,4,42,8],[42,9,42,12],[42,13,42,15],[42,16,42,17],[42,18,42,19],[42,20,42,21],[42,22,42,23],[42,24,42,25],[42,26,42,27],[42,28,42,39],[43,0,43,3],[43,4,43,8],[43,9,43,12],[43,13,43,15],[43,16,43,17],[43,18,43,19],[43,20,43,21],[43,22,43,23],[43,24,43,25],[43,26,43,27],[43,28,43,39],[44,0,44,3],[44,4,44,8],[44,9,44,12],[44,13,44,15],[44,16,44,17],[44,18,44,19],[44,20,44,21],[44,22,44,23],[44,24,44,25],[44,26,44,27],[44,28,44,39],[45,0,45,3],[45,4,45,8],[45,9,45,12],[45,13,45,15],[45,16,45,17],[45,18,45,19],[45,20,45,21],[45,22,45,23],[45,24,45,25],[45,26,45,27],[45,28,45,39],[46,0,46,3],[46,4,46,8],[46,9,46,12],[46,13,46,15],[46,16,46,17],[46,18,46,19],[46,20,46,21],[46,22,46,23],[46,24,46,25],[46,26,46,27],[46,28,46,39],[47,0,47,3],[47,4,47,8],[47,9,47,12],[47,13,47,15],[47,16,47,17],[47,18,47,19],[47,20,47,21],[47,22,47,23],[47,24,47,25],[47,26,47,27],[47,28,47,39],[48,0,48,3],[48,4,48,8],[48,9,48,12],[48,13,48,15],[48,16,48,17],[48,18,48,19],[48,20,48,21],[48,22,48,23],[48,24,48,25],[48,26,48,27],[48,28,48,39],[49,0,49,3],[49,4,49,8],[49,9,49,12],[49,13,49,15],[49,16,49,17],[49,18,49,19],[49,20,49,21],[49,22,49,23],[49,24,49,25],[49,26,49,27],[49,28,49,39],[50,0,50,3],[50,4,50,8],[50,9,50,12],[50,13,50,15],[50,16,50,17],[50,18,50,19],[50,20,50,21],[50,22,50,23],[50,24,50,25],[50,26,50,27],[50,28,50,39],[51,0,51,3],[51,4,51,8],[51,9,51,12],[51,13,51,15],[51,16,51,17],[51,18,51,19],[51,20,51,21],[51,22,51,23],[51,24,51,25],[51,26,51,27],[51,28,51,39],[52,0,52,3],[52,4,52,8],[52,9,52,12],[52,13,52,15],[52,16,52,17],[52,18,52,19],[52,20,52,21],[52,22,52,23],[52,24,52,25],[52,26,52,27],[52,28,52,39],[53,0,53,3],[53,4,53,8],[53,9,53,12],[53,13,53,15],[53,16,53,17],[53,18,53,19],[53,20,53,21],[53,22,53,23],[53,24,53,25],[53,26,53,27],[53,28,53,39],[54,0,54,3],[54,4,54,8],[54,9,54,12],[54,13,54,15],[54,16,54,17],[54,18,54,19],[54,20,54,21],[54,22,54,23],[54,24,54,25],[54,26,54,27],[54,28,54,39],[55,0,55,3],[55,4,55,8],[55,9,55,12],[55,13,55,15],[55,16,55,17],[55,18,55,19],[55,20,55,21],[55,22,55,23],[55,24,55,25],[55,26,55,27],[55,28,55,39],[56,0,56,39],[57,0,57,7],[57,8,57,20],[57,21,60,22],[57,26,60,39],[58,0,58,7],[58,8,58,20],[59,0,59,7],[59,8,59,20],[60,0,60,7],[60,8,60,20],[61,0,61,7],[61,8,61,20],[61,21,61,22],[61,26,61,39]]}
[{"$f":"Sprachen!L271","v":"Produktbezogene Nachweise"},{"$nulls":12},{"$f":"Sprachen!L378","v":"Bericht"},{"$nulls":6},{"$f":"IF(H4<>\"\",H4&\" / \"&H5,\"\")","v":""},{"$nulls":7},{"$f":"Sprachen!L88","v":"Blatt"},{"$nulls":5},{"$f":"Sprachen!L364","v":"von"},{"$nulls":6},"Sprachauswahl"]
[{"$nulls":13},{"$f":"Sprachen!L255","v":"Organisation"},{"$nulls":6},{"$f":"IF('Deckblatt '!U2<>\"\",'Deckblatt '!U2,\"\")","v":""},{"$nulls":20},{"$f":"'PPF-Bewertung'!AP3","v":"Deutsch"}]
[{"$f":"Sprachen!L46","v":"Angaben zur Organisation"},{"$nulls":13},{"$f":"Sprachen!L44","v":"Angaben zu Mustern"},{"$nulls":12},{"$f":"Sprachen!L45","v":"Angaben zum Kunden"}]
[{"$f":"Sprachen!L75","v":"Berichtsnummer"},{"$nulls":6},{"$f":"IF('Deckblatt '!H16<>\"\",'Deckblatt '!H16,\"\")","v":""},{"$nulls":6},{"$f":"Sprachen!L198","v":"Lieferscheinnummer"},{"$nulls":6},{"$f":"IF('Deckblatt '!V16<>\"\",'Deckblatt '!V16,\"\")","v":""},{"$nulls":5},{"$f":"Sprachen!L187","v":"Kunde"},{"$nulls":6},{"$f":"IF('Deckblatt '!A10<>\"\",'Deckblatt '!A10,\"\")","v":""}]
[{"$f":"Sprachen!L77","v":"Berichtsversion"},{"$nulls":6},{"$f":"IF('Deckblatt '!H17<>\"\",'Deckblatt '!H17,\"\")","v":""},{"$nulls":6},{"$f":"Sprachen!L197","v":"Liefermenge"},{"$nulls":6},{"$f":"IF('Deckblatt '!V17<>\"\",'Deckblatt '!V17,\"\")","v":""}]
[{"$f":"Sprachen!L199","v":"Lieferstandort"},{"$nulls":6},{"$f":"IF('Deckblatt '!H18<>\"\",'Deckblatt '!H18,\"\")","v":""},{"$nulls":6},{"$f":"Sprachen!L89","v":"Chargennummer"},{"$nulls":6},{"$f":"IF('Deckblatt '!V18<>\"\",'Deckblatt '!V18,\"\")","v":""},{"$nulls":5},{"$f":"Sprachen!L87","v":"Bestellnr. PPF-Muster"},{"$nulls":6},{"$f":"IF('Deckblatt '!AI18<>\"\",'Deckblatt '!AI18,\"\")","v":""}]
[{"$f":"Sprachen!L276","v":"Produktionsstandort"},{"$nulls":6},{"$f":"IF('Deckblatt '!H19<>\"\",'Deckblatt '!H19,\"\")","v":""},{"$nulls":6},{"$f":"Sprachen!L217","v":"Mustergewicht [kg]"},{"$nulls":6},{"$f":"IF('Deckblatt '!V19<>\"\",'Deckblatt '!V19,\"\")","v":""},{"$nulls":5},{"$f":"Sprachen!L14","v":"Abladestelle"},{"$nulls":6},{"$f":"IF('Deckblatt '!AI19<>\"\",'Deckblatt '!AI19,\"\")","v":""}]
[{"$f":"Sprachen!L304","v":"Sachnummer"},{"$nulls":6},{"$f":"IF('Deckblatt '!H20<>\"\",'Deckblatt '!H20,\"\")","v":""},{"$nulls":6},{"$f":"Sprachen!L166","v":"Hardwarestand"},{"$nulls":6},{"$f":"IF('Deckblatt '!V20<>\"\",'Deckblatt '!V20,\"\")","v":""},{"$nulls":5},{"$f":"Sprachen!L304","v":"Sachnummer"},{"$nulls":6},{"$f":"IF('Deckblatt '!AI20<>\"\",'Deckblatt '!AI20,\"\")","v":""}]
[{"$f":"Sprachen!L65","v":"Benennung"},{"$nulls":6},{"$f":"IF('Deckblatt '!H21<>\"\",'Deckblatt '!H21,\"\")","v":""},{"$nulls":6},{"$f":"Sprachen!L98","v":"Diagnosestand"},{"$nulls":6},{"$f":"IF('Deckblatt '!V21<>\"\",'Deckblatt '!V21,\"\")","v":""},{"$nulls":5},{"$f":"Sprachen!L65","v":"Benennung"},{"$nulls":6},{"$f":"IF('Deckblatt '!AI21<>\"\",'Deckblatt '!AI21,\"\")","v":""}]
[{"$f":"Sprachen!L374","v":"Zeichnungsnummer"},{"$nulls":6},{"$f":"IF('Deckblatt '!H22<>\"\",'Deckblatt '!H22,\"\")","v":""},{"$nulls":6},{"$f":"Sprachen!L326","v":"Softwarestand"},{"$nulls":6},{"$f":"IF('Deckblatt '!V22<>\"\",'Deckblatt '!V22,\"\")","v":""},{"$nulls":5},{"$f":"Sprachen!L374","v":"Zeichnungsnummer"},{"$nulls":6},{"$f":"IF('Deckblatt '!AI22<>\"\",'Deckblatt '!AI22,\"\")","v":""}]
[{"$f":"Sprachen!L361","v":"Version/ Datum"},{"$nulls":6},{"$f":"IF('Deckblatt '!H23<>\"\",'Deckblatt '!H23,\"\")","v":""},{"$nulls":6},{"$f":"Sprachen!L177","v":"Kennung/DUNS"},{"$nulls":6},{"$f":"IF('Deckblatt '!V23<>\"\",'Deckblatt '!V23,\"\")","v":""},{"$nulls":5},{"$f":"Sprachen!L361","v":"Version/ Datum"},{"$nulls":6},{"$f":"IF('Deckblatt '!AI23<>\"\",'Deckblatt '!AI23,\"\")","v":""}]
[{"$f":"IF('Deckblatt '!A24:N24<>\"\",'Deckblatt '!A24:N24,\"\")","v":"-"}]
[{"$f":"IF('PPF-Bewertung'!M29=\"ja\",\"x\",IF('PPF-Bewertung'!M29=\"yes\",\"x\",\"\"))","v":""},null,null,"3.1",null,{"$f":"Sprachen!L153","v":"Geometrie, Maß"},{"$nulls":8},{"$f":"IF('PPF-Bewertung'!M33=\"ja\",\"x\",IF('PPF-Bewertung'!M33=\"yes\",\"x\",\"\"))","v":""},null,"3.5",null,{"$f":"Sprachen!L27","v":"Akustik"},{"$nulls":8},{"$f":"IF('PPF-Bewertung'!M37=\"ja\",\"x\",IF('PPF-Bewertung'!M37=\"yes\",\"x\",\"\"))","v":""},null,"3.9",null,{"$f":"Sprachen!L333","v":"Technische Sauberkeit"}]
[{"$f":"IF('PPF-Bewertung'!M30=\"ja\",\"x\",IF('PPF-Bewertung'!M30=\"yes\",\"x\",\"\"))","v":""},null,null,"3.2",null,{"$f":"Sprachen!L367","v":"Werkstoff"},{"$nulls":8},{"$f":"IF('PPF-Bewertung'!M34=\"ja\",\"x\",IF('PPF-Bewertung'!M34=\"yes\",\"x\",\"\"))","v":""},null,"3.6",null,{"$f":"Sprachen!L154","v":"Geruch"},{"$nulls":8},{"$f":"IF('PPF-Bewertung'!M38=\"ja\",\"x\",IF('PPF-Bewertung'!M38=\"yes\",\"x\",\"\"))","v":""},null,"3.10",null,{"$f":"Sprachen!L377","v":"Zuverlässigkeit"},{"$nulls":12}," "]
[{"$f":"IF('PPF-Bewertung'!M31=\"ja\",\"x\",IF('PPF-Bewertung'!M31=\"yes\",\"x\",\"\"))","v":""},null,null,"3.3",null,{"$f":"Sprachen!L144","v":"Funktion"},{"$nulls":8},{"$f":"IF('PPF-Bewertung'!M35=\"ja\",\"x\",IF('PPF-Bewertung'!M35=\"yes\",\"x\",\"\"))","v":""},null,"3.7",null,{"$f":"Sprachen!L56","v":"Aussehen"},{"$nulls":8},{"$f":"IF('PPF-Bewertung'!M39=\"ja\",\"x\",IF('PPF-Bewertung'!M39=\"yes\",\"x\",\"\"))","v":""},null,"3.11",null,{"$f":"Sprachen!L82","v":"Beständigkeit gegenüber Electrostatic Discharge (ESD) "}]
[{"$f":"IF('PPF-Bewertung'!M32=\"ja\",\"x\",IF('PPF-Bewertung'!M32=\"yes\",\"x\",\"\"))","v":""},null,null,"3.4",null,{"$f":"Sprachen!L161","v":"Haptik"},{"$nulls":8},{"$f":"IF('PPF-Bewertung'!M36=\"ja\",\"x\",IF('PPF-Bewertung'!M36=\"yes\",\"x\",\"\"))","v":""},null,"3.8",null,{"$f":"Sprachen!L252","v":"Oberflächenanforderung"},{"$nulls":8},{"$f":"IF('PPF-Bewertung'!M40=\"ja\",\"x\",IF('PPF-Bewertung'!M40=\"yes\",\"x\",\"\"))","v":""},null,"3.12",null,{"$f":"Sprachen!L117","v":"Elektrische Sicherheit / Hochvolt-Sicherheit"}]
[{"$nulls":27},{"$f":"IF('PPF-Bewertung'!M41=\"ja\",\"x\",IF('PPF-Bewertung'!M41=\"yes\",\"x\",\"\"))","v":""},null,"3.13",null,{"$f":"Sprachen!L118","v":"Elektromagnetische Verträglichkeit (EMV)"}]
[{"$f":"Sprachen!L248","v":"Nr."},{"$nulls":3},{"$f":"Sprachen!L41","v":"Anforderungen/\nSpezifikation"},{"$nulls":11},{"$f":"Sprachen!L171","v":"IST-Werte Organisation"},{"$nulls":9},{"$f":"Sprachen!L328","v":"Spezifikation erfüllt"},null,{"$f":"Sprachen!L61","v":"Bemerkung"}]
[{"$nulls":4},{"$f":"Sprachen!L475","v":"Sollwert"},{"$nulls":4},{"$f":"Sprachen!L476","v":"untere Toleranz"},{"$nulls":3},{"$f":"Sprachen!L477","v":"obere Toleranz"},null,null,1,null,2,null,3,null,4,null,5]
{"$rows_empty":37}
[{"$f":"Sprachen!L84","v":"Bestätigung Organisation"}]
[{"$f":"Sprachen!L234","v":"Name"},{"$nulls":20},{"$f":"Sprachen!L61","v":"Bemerkung"}]
[{"$f":"Sprachen!L20","v":"Abteilung"}]
[{"$f":"Sprachen!L343","v":"Telefon"}]
[{"$f":"Sprachen!L119","v":"E-Mail/Fax-Nr."}]
[{"$f":"Sprachen!L91","v":"Datum"},{"$nulls":20},{"$f":"Sprachen!L348","v":"Unterschrift"}]

{"sheet":"Selbstb. Produkt ","index":7,"n_rows":32,"n_cols":46,"rows_kept":32,"merged":[[0,0,1,12],[0,13,0,39],[1,13,1,19],[1,20,1,39],[2,0,2,13],[2,14,2,26],[2,27,2,39],[3,0,3,6],[3,7,3,13],[3,14,3,20],[3,21,3,26],[3,27,4,33],[3,34,4,39],[4,0,4,6],[4,7,4,13],[4,14,4,20],[4,21,4,26],[5,0,5,6],[5,7,5,13],[5,14,5,20],[5,21,5,26],[5,27,5,33],[5,34,5,39],[6,0,6,6],[6,7,6,13],[6,14,6,20],[6,21,6,26],[6,27,6,33],[6,34,6,39],[7,0,7,6],[7,7,7,13],[7,14,7,20],[7,21,7,26],[7,27,7,33],[7,34,7,39],[8,0,8,6],[8,7,8,13],[8,14,8,20],[8,21,8,26],[8,27,8,33],[8,34,8,39],[9,0,9,6],[9,7,9,13],[9,14,9,20],[9,21,9,26],[9,27,9,33],[9,34,9,39],[10,0,10,6],[10,7,10,13],[10,14,10,20],[10,21,10,26],[10,27,10,33],[10,34,10,39],[11,0,11,13],[12,0,12,5],[12,6,12,13],[12,14,12,21],[12,22,12,29],[12,30,12,31],[12,32,12,39],[13,0,14,5],[13,6,13,13],[13,14,13,21],[13,22,13,29],[13,30,13,31],[13,32,14,39],[14,6,14,13],[14,14,14,21],[14,22,14,29],[14,30,14,31],[15,0,16,5],[15,6,15,13],[15,14,15,21],[15,22,15,29],[15,30,15,31],[15,32,16,39],[16,6,16,13],[16,14,16,21],[16,22,16,29],[16,30,16,31],[17,0,18,5],[17,6,17,13],[17,14,17,21],[17,22,17,29],[17,30,17,31],[17,32,18,39],[17,45,20,45],[18,6,18,13],[18,14,18,21],[18,22,18,29],[18,30,18,31],[19,0,20,5],[19,6,19,13],[19,14,19,21],[19,22,19,29],[19,30,19,31],[19,32,20,39],[20,6,20,13],[20,14,20,21],[20,22,20,29],[20,30,20,31],[21,0,22,5],[21,6,21,13],[21,14,21,21],[21,22,21,29],[21,30,21,31],[21,32,22,39],[22,6,22,13],[22,14,22,21],[22,22,22,29],[22,30,22,31],[23,0,24,5],[23,6,23,13],[23,14,23,21],[23,22,23,29],[23,30,23,31],[23,32,24,39],[24,6,24,13],[24,14,24,21],[24,22,24,29],[24,30,24,31],[25,0,25,17],[25,18,25,39],[26,0,26,39],[27,0,27,7],[27,8,27,20],[27,21,30,25],[27,26,30,39],[28,0,28,7],[28,8,28,20],[29,0,29,7],[29,8,29,20],[30,0,30,7],[30,8,30,20],[31,0,31,7],[31,8,31,20],[31,21,31,25],[31,26,31,39]]}
[{"$f":"Sprachen!L312","v":"Selbstbeurteilung Produkt"},{"$nulls":40},"Sprachauswahl"]
[{"$nulls":13},{"$f":"Sprachen!L255","v":"Organisation"},{"$nulls":6},{"$f":"IF('Deckblatt '!U2<>\"\",'Deckblatt '!U2,\"\")","v":""}]
[{"$f":"Sprachen!L46","v":"Angaben zur Organisation"},{"$nulls":13},{"$f":"Sprachen!L44","v":"Angaben zu Mustern"},{"$nulls":12},{"$f":"Sprachen!L45","v":"Angaben zum Kunden"}]
[{"$f":"Sprachen!L75","v":"Berichtsnummer"},{"$nulls":6},{"$f":"IF('Deckblatt '!H16<>\"\",'Deckblatt '!H16,\"\")","v":""},{"$nulls":6},{"$f":"Sprachen!L198","v":"Lieferscheinnummer"},{"$nulls":6},{"$f":"IF('Deckblatt '!V16<>\"\",'Deckblatt '!V16,\"\")","v":""},{"$nulls":5},{"$f":"Sprachen!L187","v":"Kunde"},{"$nulls":6},{"$f":"IF('Deckblatt '!A10<>\"\",'Deckblatt '!A10,\"\")","v":""}]
[{"$f":"Sprachen!L77","v":"Berichtsversion"},{"$nulls":6},{"$f":"IF('Deckblatt '!H17<>\"\",'Deckblatt '!H17,\"\")","v":""},{"$nulls":6},{"$f":"Sprachen!L197","v":"Liefermenge"},{"$nulls":6},{"$f":"IF('Deckblatt '!V17<>\"\",'Deckblatt '!V17,\"\")","v":""}]
[{"$f":"Sprachen!L199","v":"Lieferstandort"},{"$nulls":6},{"$f":"IF('Deckblatt '!H18<>\"\",'Deckblatt '!H18,\"\")","v":""},{"$nulls":6},{"$f":"Sprachen!L89","v":"Chargennummer"},{"$nulls":6},{"$f":"IF('Deckblatt '!V18<>\"\",'Deckblatt '!V18,\"\")","v":""},{"$nulls":5},{"$f":"Sprachen!L87","v":"Bestellnr. PPF-Muster"},{"$nulls":6},{"$f":"IF('Deckblatt '!AI18<>\"\",'Deckblatt '!AI18,\"\")","v":""}]
[{"$f":"Sprachen!L276","v":"Produktionsstandort"},{"$nulls":6},{"$f":"IF('Deckblatt '!H19<>\"\",'Deckblatt '!H19,\"\")","v":""},{"$nulls":6},{"$f":"Sprachen!L217","v":"Mustergewicht [kg]"},{"$nulls":6},{"$f":"IF('Deckblatt '!V19<>\"\",'Deckblatt '!V19,\"\")","v":""},{"$nulls":5},{"$f":"Sprachen!L14","v":"Abladestelle"},{"$nulls":6},{"$f":"IF('Deckblatt '!AI19<>\"\",'Deckblatt '!AI19,\"\")","v":""}]
[{"$f":"Sprachen!L304","v":"Sachnummer"},{"$nulls":6},{"$f":"IF('Deckblatt '!H20<>\"\",'Deckblatt '!H20,\"\")","v":""},{"$nulls":6},{"$f":"Sprachen!L166","v":"Hardwarestand"},{"$nulls":6},{"$f":"IF('Deckblatt '!V20<>\"\",'Deckblatt '!V20,\"\")","v":""},{"$nulls":5},{"$f":"Sprachen!L304","v":"Sachnummer"},{"$nulls":6},{"$f":"IF('Deckblatt '!AI20<>\"\",'Deckblatt '!AI20,\"\")","v":""}]
[{"$f":"Sprachen!L65","v":"Benennung"},{"$nulls":6},{"$f":"IF('Deckblatt '!H21<>\"\",'Deckblatt '!H21,\"\")","v":""},{"$nulls":6},{"$f":"Sprachen!L98","v":"Diagnosestand"},{"$nulls":6},{"$f":"IF('Deckblatt '!V21<>\"\",'Deckblatt '!V21,\"\")","v":""},{"$nulls":5},{"$f":"Sprachen!L65","v":"Benennung"},{"$nulls":6},{"$f":"IF('Deckblatt '!AI21<>\"\",'Deckblatt '!AI21,\"\")","v":""}]
[{"$f":"Sprachen!L374","v":"Zeichnungsnummer"},{"$nulls":6},{"$f":"IF('Deckblatt '!H22<>\"\",'Deckblatt '!H22,\"\")","v":""},{"$nulls":6},{"$f":"Sprachen!L326","v":"Softwarestand"},{"$nulls":6},{"$f":"IF('Deckblatt '!V22<>\"\",'Deckblatt '!V22,\"\")","v":""},{"$nulls":5},{"$f":"Sprachen!L374","v":"Zeichnungsnummer"},{"$nulls":6},{"$f":"IF('Deckblatt '!AI22<>\"\",'Deckblatt '!AI22,\"\")","v":""}]
[{"$f":"Sprachen!L361","v":"Version/ Datum"},{"$nulls":6},{"$f":"IF('Deckblatt '!H23<>\"\",'Deckblatt '!H23,\"\")","v":""},{"$nulls":6},{"$f":"Sprachen!L177","v":"Kennung/DUNS"},{"$nulls":6},{"$f":"IF('Deckblatt '!V23<>\"\",'Deckblatt '!V23,\"\")","v":""},{"$nulls":5},{"$f":"Sprachen!L361","v":"Version/ Datum"},{"$nulls":6},{"$f":"IF('Deckblatt '!AI23<>\"\",'Deckblatt '!AI23,\"\")","v":""}]
[{"$f":"IF('Deckblatt '!A24:N24<>\"\",'Deckblatt '!A24:N24,\"\")","v":"-"}]
[{"$f":"Sprachen!L172","v":"Kategorie"},{"$nulls":5},{"$f":"Sprachen!L6","v":"Anforderungen erfüllt"},{"$nulls":7},{"$f":"Sprachen!L7","v":"Anforderungen nicht vollständig erfüllt"},{"$nulls":7},{"$f":"Sprachen!L8","v":"Anforderungen nicht erfüllt"},{"$nulls":7},{"$f":"Sprachen!L380","v":"Nicht anwendbar"},null,{"$f":"Sprachen!L63","v":"Bemerkung/Maßnahmen + Termin \n(sofern nicht OK ausgewählt) (5)"},{"$nulls":7},"grün","gelb","rot","NA"]
[{"$f":"Sprachen!L205","v":"Maß"},{"$nulls":5},{"$f":"Sprachen!L206","v":"Maßlich i. O., \nkeine Nacharbeit"},{"$nulls":7},{"$f":"Sprachen!L207","v":"Maßlich i. O. \nmit Nacharbeit oder unkritische Werte n. i. O. "},{"$nulls":7},{"$f":"Sprachen!L208","v":"Maßlich n. i. O."}]
[{"$nulls":40},{"$f":"G15=\"X\"","v":false},{"$f":"O15=\"X\"","v":false},{"$f":"W15=\"X\"","v":false},{"$f":"AE15=\"X\"","v":false},{"$f":"COUNTIF(AO15:AR15,TRUE)","v":0}]
[{"$f":"Sprachen!L367","v":"Werkstoff"},{"$nulls":5},{"$f":"Sprachen!L315","v":"Serienwerkstoff\ngemäß Spezifikation"},{"$nulls":7},{"$f":"Sprachen!L175","v":"Kein Serienwerkstoff oder andere Verarbeitung,\nKundenakzeptanz liegt vor "},{"$nulls":7},{"$f":"Sprachen!L176","v":"Kein Serienwerkstoff,\nSpezifikation nicht erfüllt/nicht nachgewiesen"}]
[{"$nulls":40},{"$f":"G17=\"X\"","v":false},{"$f":"O17=\"X\"","v":false},{"$f":"W17=\"X\"","v":false},{"$f":"AE17=\"X\"","v":false},{"$f":"COUNTIF(AO17:AR17,TRUE)","v":0}]
[{"$f":"Sprachen!L145","v":"Funktion/EMV/ ESD"},{"$nulls":5},{"$f":"Sprachen!L146","v":"Funktion erfüllt,\nentspricht Spezifikation"},{"$nulls":7},{"$f":"Sprachen!L11","v":"Abweichung zur Spezifikation,\nKundenakzeptanz liegt vor "},{"$nulls":7},{"$f":"Sprachen!L147","v":"Funktion n. i. O. bzw. Funktion nicht nachgewiesen,\nSpezifikation nicht erfüllt"}]
[{"$nulls":40},{"$f":"G19=\"X\"","v":false},{"$f":"O19=\"X\"","v":false},{"$f":"W19=\"X\"","v":false},{"$f":"AE19=\"X\"","v":false},{"$f":"COUNTIF(AO19:AR19,TRUE)","v":0}]
[{"$f":"Sprachen!L250","v":"Oberfläche/ Struktur\nFarbe/Narbung"},{"$nulls":5},{"$f":"Sprachen!L167","v":"i. O.  "},{"$nulls":7},{"$f":"Sprachen!L126","v":"Entspricht nicht dem Serienstand, Kundenakzeptanz liegt vor "},{"$nulls":7},{"$f":"Sprachen!L125","v":"Entspricht nicht dem Serienstand,\nKundenakzeptanz liegt nicht vor"}]
[{"$nulls":40},{"$f":"G21=\"X\"","v":false},{"$f":"O21=\"X\"","v":false},{"$f":"W21=\"X\"","v":false},{"$f":"AE21=\"X\"","v":false},{"$f":"COUNTIF(AO21:AR21,TRUE)","v":0}]
[{"$f":"Sprachen!L265","v":"PPF-Status Lieferkette"},{"$nulls":5},{"$f":"Sprachen!L190","v":"Kunden-/Serientauglich (Anforderungen erfüllt oder Abweichungen nach Risikoanalyse akzeptiert)"},{"$nulls":7},{"$f":"Sprachen!L192","v":"Kunden-/Serientauglich nach Risikobewertung,\naktualisierte PPF-Dokumentation erforderlich"},{"$nulls":7},{"$f":"Sprachen!L244","v":"Nicht kunden- oder serientauglich bzw. noch nicht freigegeben"}]
[{"$nulls":40},{"$f":"G23=\"X\"","v":false},{"$f":"O23=\"X\"","v":false},{"$f":"W23=\"X\"","v":false},{"$f":"AE23=\"X\"","v":false},{"$f":"COUNTIF(AO23:AR23,TRUE)","v":0}]
[{"$f":"Sprachen!L356","v":"Verbaubarkeit (beim Kunden)"},{"$nulls":5},{"$f":"Sprachen!L353","v":"Verbaubar \nohne Mehraufwand"},{"$nulls":7},{"$f":"Sprachen!L354","v":"Verbaubar mit Mehraufwand,\nKundenakzeptanz liegt vor "},{"$nulls":7},{"$f":"Sprachen!L245","v":"Nicht verbaubar"}]
[{"$nulls":40},{"$f":"G25=\"X\"","v":false},{"$f":"O25=\"X\"","v":false},{"$f":"W25=\"X\"","v":false},{"$f":"AE25=\"X\"","v":false},{"$f":"COUNTIF(AO25:AR25,TRUE)","v":0}]
[{"$f":"Sprachen!L311","v":"Selbstbeurteilung Organisation"},{"$nulls":17},{"$f":"IF(AND(AT26=6,AS26=0),IF(AQ26>0,W13,IF(AP26>0,O13,IF(AO26>0,G13,\"\"))),Sprachen!L9)","v":"Eingabe nicht korrekt, bitte prüfen"},{"$nulls":21},{"$f":"COUNTIF(AO14:AO25,TRUE)","v":0},{"$f":"COUNTIF(AP14:AP25,TRUE)","v":0},{"$f":"COUNTIF(AQ14:AQ25,TRUE)","v":0},{"$f":"COUNTIF(AR14:AR25,TRUE)","v":0},{"$f":"COUNTIF(AS14:AS25,0)","v":6},{"$f":"SUM(AO26:AR26)","v":0}]
[{"$f":"Sprachen!L84","v":"Bestätigung Organisation"}]
[{"$f":"Sprachen!L234","v":"Name"},{"$nulls":20},{"$f":"Sprachen!L61","v":"Bemerkung"}]
[{"$f":"Sprachen!L20","v":"Abteilung"}]
[{"$f":"Sprachen!L343","v":"Telefon"}]
[{"$f":"Sprachen!L119","v":"E-Mail/Fax-Nr."}]
[{"$f":"Sprachen!L91","v":"Datum"},{"$nulls":20},{"$f":"Sprachen!L348","v":"Unterschrift"}]

{"sheet":"Selbstb. Prozess","index":8,"n_rows":43,"n_cols":46,"rows_kept":43,"merged":[[0,0,1,12],[0,13,0,39],[1,13,1,19],[1,20,1,39],[2,0,2,13],[2,14,2,26],[2,27,2,39],[3,0,3,6],[3,7,3,13],[3,14,3,20],[3,21,3,26],[3,27,4,33],[3,34,4,39],[4,0,4,6],[4,7,4,13],[4,14,4,20],[4,21,4,26],[5,0,5,6],[5,7,5,13],[5,14,5,20],[5,21,5,26],[5,27,5,33],[5,34,5,39],[6,0,6,6],[6,7,6,13],[6,14,6,20],[6,21,6,26],[6,27,6,33],[6,34,6,39],[7,0,7,6],[7,7,7,13],[7,14,7,20],[7,21,7,26],[7,27,7,33],[7,34,7,39],[8,0,8,6],[8,7,8,13],[8,14,8,20],[8,21,8,26],[8,27,8,33],[8,34,8,39],[9,0,9,6],[9,7,9,13],[9,14,9,20],[9,21,9,26],[9,27,9,33],[9,34,9,39],[10,0,10,6],[10,7,10,13],[10,14,10,20],[10,21,10,26],[10,27,10,33],[10,34,10,39],[11,0,11,13],[12,0,12,5],[12,6,12,13],[12,14,12,21],[12,22,12,29],[12,30,12,31],[12,32,12,39],[13,0,14,5],[13,6,13,13],[13,14,13,21],[13,22,13,29],[13,30,13,31],[13,32,14,39],[14,6,14,13],[14,14,14,21],[14,22,14,29],[14,30,14,31],[15,0,16,5],[15,6,15,13],[15,14,15,21],[15,22,15,29],[15,30,15,31],[15,32,16,39],[16,6,16,13],[16,14,16,21],[16,22,16,29],[16,30,16,31],[17,0,18,5],[17,6,17,13],[17,14,17,21],[17,22,17,29],[17,30,17,31],[17,32,18,39],[18,6,18,13],[18,14,18,21],[18,22,18,29],[18,30,18,31],[19,0,20,5],[19,6,19,13],[19,14,19,21],[19,22,19,29],[19,30,19,31],[19,32,20,39],[19,45,23,45],[20,6,20,13],[20,14,20,21],[20,22,20,29],[20,30,20,31],[21,0,22,5],[21,6,21,13],[21,14,21,21],[21,22,21,29],[21,30,21,31],[21,32,22,39],[22,6,22,13],[22,14,22,21],[22,22,22,29],[22,30,22,31],[23,0,26,5],[23,6,23,13],[23,14,23,21],[23,22,23,29],[23,30,23,31],[23,32,24,39],[24,6,24,13],[24,14,24,21],[24,22,24,29],[24,30,24,31],[25,6,25,13],[25,14,25,21],[25,22,25,29],[25,30,25,31],[25,32,26,39],[26,6,26,13],[26,14,26,21],[26,22,26,29],[26,30,26,31],[27,0,28,5],[27,6,27,13],[27,14,27,21],[27,22,27,29],[27,30,27,31],[27,32,28,39],[28,6,28,13],[28,14,28,21],[28,22,28,29],[28,30,28,31],[29,0,29,17],[29,18,29,39],[30,0,30,39],[31,0,31,7],[31,8,31,20],[31,21,34,25],[31,26,34,39],[32,0,32,7],[32,8,32,20],[33,0,33,7],[33,8,33,20],[34,0,34,7],[34,8,34,20],[35,0,35,7],[35,8,35,20],[35,21,35,25],[35,26,35,39],[36,0,36,39],[37,0,37,39],[38,0,38,3],[38,4,38,39],[39,0,39,3],[39,4,39,39],[40,0,40,3],[40,4,40,39],[41,0,41,3],[41,4,41,39],[42,0,42,3],[42,4,42,39]]}
[{"$f":"Sprachen!L314","v":"Selbstbeurteilung Produktionsprozess"},{"$nulls":40},"Sprachauswahl"]
[{"$nulls":13},{"$f":"Sprachen!L255","v":"Organisation"},{"$nulls":6},{"$f":"IF('Deckblatt '!U2<>\"\",'Deckblatt '!U2,\"\")","v":""}]
[{"$f":"Sprachen!L46","v":"Angaben zur Organisation"},{"$nulls":13},{"$f":"Sprachen!L44","v":"Angaben zu Mustern"},{"$nulls":12},{"$f":"Sprachen!L45","v":"Angaben zum Kunden"}]
[{"$f":"Sprachen!L75","v":"Berichtsnummer"},{"$nulls":6},{"$f":"IF('Deckblatt '!H16<>\"\",'Deckblatt '!H16,\"\")","v":""},{"$nulls":6},{"$f":"Sprachen!L198","v":"Lieferscheinnummer"},{"$nulls":6},{"$f":"IF('Deckblatt '!V16<>\"\",'Deckblatt '!V16,\"\")","v":""},{"$nulls":5},{"$f":"Sprachen!L187","v":"Kunde"},{"$nulls":6},{"$f":"IF('Deckblatt '!A10<>\"\",'Deckblatt '!A10,\"\")","v":""}]
[{"$f":"Sprachen!L77","v":"Berichtsversion"},{"$nulls":6},{"$f":"IF('Deckblatt '!H17<>\"\",'Deckblatt '!H17,\"\")","v":""},{"$nulls":6},{"$f":"Sprachen!L197","v":"Liefermenge"},{"$nulls":6},{"$f":"IF('Deckblatt '!V17<>\"\",'Deckblatt '!V17,\"\")","v":""}]
[{"$f":"Sprachen!L199","v":"Lieferstandort"},{"$nulls":6},{"$f":"IF('Deckblatt '!H18<>\"\",'Deckblatt '!H18,\"\")","v":""},{"$nulls":6},{"$f":"Sprachen!L89","v":"Chargennummer"},{"$nulls":6},{"$f":"IF('Deckblatt '!V18<>\"\",'Deckblatt '!V18,\"\")","v":""},{"$nulls":5},{"$f":"Sprachen!L87","v":"Bestellnr. PPF-Muster"},{"$nulls":6},{"$f":"IF('Deckblatt '!AI18<>\"\",'Deckblatt '!AI18,\"\")","v":""}]
[{"$f":"Sprachen!L276","v":"Produktionsstandort"},{"$nulls":6},{"$f":"IF('Deckblatt '!H19<>\"\",'Deckblatt '!H19,\"\")","v":""},{"$nulls":6},{"$f":"Sprachen!L217","v":"Mustergewicht [kg]"},{"$nulls":6},{"$f":"IF('Deckblatt '!V19<>\"\",'Deckblatt '!V19,\"\")","v":""},{"$nulls":5},{"$f":"Sprachen!L14","v":"Abladestelle"},{"$nulls":6},{"$f":"IF('Deckblatt '!AI19<>\"\",'Deckblatt '!AI19,\"\")","v":""}]
[{"$f":"Sprachen!L304","v":"Sachnummer"},{"$nulls":6},{"$f":"IF('Deckblatt '!H20<>\"\",'Deckblatt '!H20,\"\")","v":""},{"$nulls":6},{"$f":"Sprachen!L166","v":"Hardwarestand"},{"$nulls":6},{"$f":"IF('Deckblatt '!V20<>\"\",'Deckblatt '!V20,\"\")","v":""},{"$nulls":5},{"$f":"Sprachen!L304","v":"Sachnummer"},{"$nulls":6},{"$f":"IF('Deckblatt '!AI20<>\"\",'Deckblatt '!AI20,\"\")","v":""}]
[{"$f":"Sprachen!L65","v":"Benennung"},{"$nulls":6},{"$f":"IF('Deckblatt '!H21<>\"\",'Deckblatt '!H21,\"\")","v":""},{"$nulls":6},{"$f":"Sprachen!L98","v":"Diagnosestand"},{"$nulls":6},{"$f":"IF('Deckblatt '!V21<>\"\",'Deckblatt '!V21,\"\")","v":""},{"$nulls":5},{"$f":"Sprachen!L65","v":"Benennung"},{"$nulls":6},{"$f":"IF('Deckblatt '!AI21<>\"\",'Deckblatt '!AI21,\"\")","v":""}]
[{"$f":"Sprachen!L374","v":"Zeichnungsnummer"},{"$nulls":6},{"$f":"IF('Deckblatt '!H22<>\"\",'Deckblatt '!H22,\"\")","v":""},{"$nulls":6},{"$f":"Sprachen!L326","v":"Softwarestand"},{"$nulls":6},{"$f":"IF('Deckblatt '!V22<>\"\",'Deckblatt '!V22,\"\")","v":""},{"$nulls":5},{"$f":"Sprachen!L374","v":"Zeichnungsnummer"},{"$nulls":6},{"$f":"IF('Deckblatt '!AI22<>\"\",'Deckblatt '!AI22,\"\")","v":""}]
[{"$f":"Sprachen!L361","v":"Version/ Datum"},{"$nulls":6},{"$f":"IF('Deckblatt '!H23<>\"\",'Deckblatt '!H23,\"\")","v":""},{"$nulls":6},{"$f":"Sprachen!L177","v":"Kennung/DUNS"},{"$nulls":6},{"$f":"IF('Deckblatt '!V23<>\"\",'Deckblatt '!V23,\"\")","v":""},{"$nulls":5},{"$f":"Sprachen!L361","v":"Version/ Datum"},{"$nulls":6},{"$f":"IF('Deckblatt '!AI23<>\"\",'Deckblatt '!AI23,\"\")","v":""}]
[{"$f":"IF('Deckblatt '!A24:N24<>\"\",'Deckblatt '!A24:N24,\"\")","v":"-"}]
[{"$f":"Sprachen!L172","v":"Kategorie"},{"$nulls":5},{"$f":"Sprachen!L6","v":"Anforderungen erfüllt"},{"$nulls":7},{"$f":"Sprachen!L7","v":"Anforderungen nicht vollständig erfüllt"},{"$nulls":7},{"$f":"Sprachen!L8","v":"Anforderungen nicht erfüllt"},{"$nulls":7},{"$f":"Sprachen!L240","v":"Nicht anwendbar"},null,{"$f":"Sprachen!L63","v":"Bemerkung/Maßnahmen + Termin \n(sofern nicht OK ausgewählt) (5)"},{"$nulls":7},"grün","gelb","rot","NA"]
[{"$f":"Sprachen!L277","v":"Produktions-     standort"},{"$nulls":5},{"$f":"Sprachen!L135","v":"Fertigung am Produktionsstandort \ndurch die Organisation abgenommen\n(Fertigungslayout umgesetzt, Verkettung Anlagen umgesetzt) "},{"$nulls":7},{"$f":"Sprachen!L136","v":"Fertigung am Produktionsstandort \ndurch die Organisation noch nicht abgenommen; \nKeine Qualitäts-beeinträchtigungen \nin der Serie zu erwarten"},{"$nulls":7},{"$f":"Sprachen!L137","v":"Fertigung nicht am Produktionsstandort; \n \n\nQualitätsbeeinträchtigun-gen möglich"}]
[{"$nulls":40},{"$f":"G15=\"X\"","v":false},{"$f":"O15=\"X\"","v":false},{"$f":"W15=\"X\"","v":false},{"$f":"AE15=\"X\"","v":false},{"$f":"COUNTIF(AO15:AR15,TRUE)","v":0}]
[{"$f":"Sprachen!L371","v":"Werkzeuge"},{"$nulls":5},{"$f":"Sprachen!L316","v":"Serienwerkzeug \nabgenommen"},{"$nulls":7},{"$f":"Sprachen!L317","v":"Serienwerkzeug/Kleinserienwerkzeug vorhanden, Optimierung(en) noch nötig, aber keine Qualitätsbeeinträchtigun-gen in der Serie zu erwarten"},{"$nulls":7},{"$f":"Sprachen!L370","v":"Werkzeug nicht serientauglich\n\nQualitätsbeeinträchtigun-gen in der Serie zu erwarten"}]
[{"$nulls":40},{"$f":"G17=\"X\"","v":false},{"$f":"O17=\"X\"","v":false},{"$f":"W17=\"X\"","v":false},{"$f":"AE17=\"X\"","v":false},{"$f":"COUNTIF(AO17:AR17,TRUE)","v":0}]
[{"$f":"Sprachen!L202","v":"Logistik (1)\n"},{"$nulls":5},{"$f":"Sprachen!L149","v":"Gemäß Prozessablauf"},{"$nulls":7},{"$f":"Sprachen!L241","v":"Nicht gemäß Prozessablauf, aber keine Qualitäts-beeinträchtigungen in der Serie zu erwarten"},{"$nulls":7},{"$f":"Sprachen!L295","v":"Qualitätsbeeinträchtigun-gen möglich"}]
[{"$nulls":40},{"$f":"G19=\"X\"","v":false},{"$f":"O19=\"X\"","v":false},{"$f":"W19=\"X\"","v":false},{"$f":"AE19=\"X\"","v":false},{"$f":"COUNTIF(AO19:AR19,TRUE)","v":0}]
[{"$f":"Sprachen!L81","v":"Besondere und vereinbarte Merkmale abgesichert"},{"$nulls":5},{"$f":"Sprachen!L211","v":"Merkmale abgesichert"},{"$nulls":7},{"$f":"Sprachen!L18","v":"Absicherung nicht vollständig nachgewiesen, \nZusatzmaßnahmen sind installiert,\nKundenakzeptanz liegt vor"},{"$nulls":7},{"$f":"Sprachen!L17","v":"Absicherung nicht vollständig nachgewiesen "}]
[{"$nulls":40},{"$f":"G21=\"X\"","v":false},{"$f":"O21=\"X\"","v":false},{"$f":"W21=\"X\"","v":false},{"$f":"AE21=\"X\"","v":false},{"$f":"COUNTIF(AO21:AR21,TRUE)","v":0}]
[{"$f":"Sprachen!L290","v":"Prüfmittel"},{"$nulls":5},{"$f":"Sprachen!L362","v":"Vollständig vorhanden/abgenommen,\nFähigkeit nachgewiesen"},{"$nulls":7},{"$f":"Sprachen!L249","v":"Nur teilweise vorhanden/abgenommen,\ngeeignetes Ersatzprüfmittel vorhanden"},{"$nulls":7},{"$f":"Sprachen!L246","v":"Nicht vorhanden/         nicht abgenommen"}]
[{"$nulls":40},{"$f":"G23=\"X\"","v":false},{"$f":"O23=\"X\"","v":false},{"$f":"W23=\"X\"","v":false},{"$f":"AE23=\"X\"","v":false},{"$f":"COUNTIF(AO23:AR23,TRUE)","v":0}]
[{"$f":"Sprachen!L357","v":"Vereinbarte Produktions-stückzahl"},{"$nulls":5},{"$f":"Sprachen!L30","v":"Alle Produktionseinrichtungen  \nabgenommen (2)"},{"$nulls":7},{"$f":"Sprachen!L214","v":"Mindestens eine Produktionseinheit abgenommen (2)"},{"$nulls":7},{"$f":"Sprachen!L273","v":"Produktionseinrichtungen nicht abgenommen (2)"}]
[{"$nulls":40},{"$f":"G25=\"X\"","v":false},{"$f":"O25=\"X\"","v":false},{"$f":"W25=\"X\"","v":false},{"$f":"AE25=\"X\"","v":false},{"$f":"COUNTIF(AO25:AR25,TRUE)","v":0}]
[{"$nulls":6},{"$f":"Sprachen!L279","v":"Produktionsstückzahl\nerreicht/nachgewiesen"},{"$nulls":7},{"$f":"Sprachen!L278","v":"Produktionsstückzahl\ndauerhaft erreichbar mit Sondermaßnahmen"},{"$nulls":7},{"$f":"Sprachen!L280","v":"Produktionsstückzahl \nmit Sondermaßnahmen nicht erreichbar"}]
[{"$nulls":40},{"$f":"G27=\"X\"","v":false},{"$f":"O27=\"X\"","v":false},{"$f":"W27=\"X\"","v":false},{"$f":"AE27=\"X\"","v":false},{"$f":"COUNTIF(AO27:AR27,TRUE)","v":0}]
[{"$f":"Sprachen!L259","v":"Personal"},{"$nulls":5},{"$f":"Sprachen!L128","v":"Erforderliches Personal verfügbar und geschult,\nArbeits- und Prüfanweisungen \nvollständig"},{"$nulls":7},{"$f":"Sprachen!L260","v":"Personal nur eingeschränkt verfügbar/geschult, keine Qualitätsbeeinträchtigun-gen zu erwarten (3)"},{"$nulls":7},{"$f":"Sprachen!L173","v":"Kein geschultes oder in ausreichender Anzahl verfügbares Personal,\nQualitätsbeeinträchtigun-gen möglich (4)"}]
[{"$nulls":40},{"$f":"G29=\"X\"","v":false},{"$f":"O29=\"X\"","v":false},{"$f":"W29=\"X\"","v":false},{"$f":"AE29=\"X\"","v":false},{"$f":"COUNTIF(AO29:AR29,TRUE)","v":0}]
[{"$f":"Sprachen!L311","v":"Selbstbeurteilung Organisation"},{"$nulls":17},{"$f":"IF(AND(AT30=8,AS30=0),IF(AQ30>0,W13,IF(AP30>0,O13,IF(AO30>0,G13,\"\"))),Sprachen!L9)","v":"Eingabe nicht korrekt, bitte prüfen"},{"$nulls":21},{"$f":"COUNTIF(AO14:AO29,TRUE)","v":0},{"$f":"COUNTIF(AP14:AP29,TRUE)","v":0},{"$f":"COUNTIF(AQ14:AQ29,TRUE)","v":0},{"$f":"COUNTIF(AR14:AR29,TRUE)","v":0},{"$f":"COUNTIF(AS14:AS29,0)","v":8},{"$f":"SUM(AO30:AR30)","v":0}]
[{"$f":"Sprachen!L84","v":"Bestätigung Organisation"}]
[{"$f":"Sprachen!L234","v":"Name"},{"$nulls":20},{"$f":"Sprachen!L61","v":"Bemerkung"}]
[{"$f":"Sprachen!L20","v":"Abteilung"}]
[{"$f":"Sprachen!L343","v":"Telefon"}]
[{"$f":"Sprachen!L119","v":"E-Mail/Fax-Nr."}]
[{"$f":"Sprachen!L91","v":"Datum"},{"$nulls":20},{"$f":"Sprachen!L348","v":"Unterschrift"}]
[]
[{"$f":"Sprachen!L53","v":"Ausfüllhilfen:"}]
["(1)",{"$nulls":3},{"$f":"Sprachen!L203","v":"Logistik: wenn zutreffend bewerten\n- zum Kunden\n- innerhalb der Organisation\n- von Lieferanten\n(z. B. Transport-, Verpackungsvorschriften erstellt, Serienverpackung in vereinbarter Menge vorhanden, keine Qualitätsbeeinträchtigung in der Serie zu erwarten)"}]
["(2)",{"$nulls":3},{"$f":"Sprachen!L358","v":"Vereinbarte Produktionsstückzahl: \nProduktionseinrichtungen beziehen sich auf Linien/Anlagen/Maschinen/Werkzeuge/Kavitäten/Nester"}]
["(3)",{"$nulls":3},{"$f":"Sprachen!L261","v":"Personal nur eingeschränkt verfügbar/qualifiziert, keine Qualitätsbeeinträchtigungen zu erwarten:\n- Anzahl und Qualifikationsgrad müssen noch optimiert werden\n- Arbeits- und Prüfanweisungen vollständig"}]
["(4)",{"$nulls":3},{"$f":"Sprachen!L174","v":"Qualifiziertes Personal nicht in ausreichender Anzahl verfügbar:\nQualitätsbeeinträchtigungen möglich\nArbeits- und/oder Prüfanweisungen unvollständig"}]
["(5)",{"$nulls":3},{"$f":"Sprachen!L379","v":"Eingabe erforderlich, sofern nicht mit „Anforderung erfüllt“ bewertet"}]

{"sheet":"Anlage 5 Deckblatt Software 1","index":9,"n_rows":85,"n_cols":53,"rows_kept":85,"hidden":true,"merged":[[0,0,1,12],[0,13,0,19],[0,20,0,39],[1,13,1,19],[1,20,1,39],[2,0,2,13],[2,14,2,26],[2,27,2,39],[3,0,3,6],[3,7,3,13],[3,14,4,20],[3,21,4,26],[3,27,4,33],[3,34,4,39],[4,0,4,6],[4,7,4,13],[5,0,5,6],[5,7,5,13],[5,14,5,20],[5,21,5,26],[5,27,5,33],[5,34,5,39],[6,0,6,6],[6,7,6,13],[6,14,6,20],[6,21,6,26],[6,27,6,33],[6,34,6,39],[7,0,7,6],[7,7,7,13],[7,14,7,20],[7,21,7,26],[7,27,7,33],[7,34,7,39],[8,0,8,6],[8,7,8,13],[8,14,8,20],[8,21,8,26],[8,27,8,33],[8,34,8,39],[9,0,9,6],[9,7,9,13],[9,14,9,20],[9,21,9,26],[9,27,9,33],[9,34,9,39],[10,0,10,6],[10,7,10,13],[10,14,10,20],[10,21,10,26],[10,27,10,33],[10,34,10,39],[11,0,11,13],[12,0,12,39],[13,0,13,39],[14,0,14,20],[14,21,14,39],[15,0,15,20],[15,21,15,39],[16,0,16,39],[17,0,21,0],[17,1,18,2],[17,3,18,9],[17,10,18,13],[17,14,18,17],[17,18,18,21],[17,22,18,25],[17,26,17,27],[17,28,17,30],[17,31,18,39],[19,1,19,2],[19,3,19,9],[19,10,19,13],[19,14,19,17],[19,18,19,21],[19,22,19,25],[19,31,19,39],[20,1,20,2],[20,3,20,9],[20,10,20,13],[20,14,20,17],[20,18,20,21],[20,22,20,25],[20,31,20,39],[21,1,21,2],[21,3,21,9],[21,10,21,13],[21,14,21,17],[21,18,21,21],[21,22,21,25],[21,31,21,39],[22,0,23,0],[22,1,22,2],[22,3,22,39],[23,1,23,2],[23,3,23,39],[24,0,24,39],[25,0,34,0],[25,1,25,2],[25,3,25,5],[25,6,25,11],[25,12,25,13],[25,14,25,15],[25,16,25,17],[25,18,25,19],[25,20,25,26],[25,27,25,30],[25,31,25,39],[26,1,26,2],[26,3,26,11],[26,12,26,13],[26,14,26,15],[26,16,26,17],[26,18,26,19],[26,20,26,26],[26,27,26,30],[26,31,26,39],[26,46,36,46],[26,47,36,47],[26,48,36,48],[26,49,36,49],[26,50,36,50],[27,1,27,2],[27,3,27,11],[27,12,27,13],[27,14,27,15],[27,16,27,17],[27,18,27,19],[27,20,27,26],[27,27,27,30],[27,31,27,39],[28,1,28,2],[28,3,28,11],[28,12,28,13],[28,14,28,15],[28,16,28,17],[28,18,28,19],[28,20,28,26],[28,27,28,30],[28,31,28,39],[29,1,29,2],[29,3,29,11],[29,12,29,13],[29,14,29,15],[29,16,29,17],[29,18,29,19],[29,20,29,26],[29,27,29,30],[29,31,29,39],[30,1,30,2],[30,3,30,11],[30,12,30,13],[30,14,30,15],[30,16,30,17],[30,18,30,19],[30,20,30,26],[30,27,30,30],[30,31,30,39],[31,1,31,2],[31,3,31,11],[31,12,31,13],[31,14,31,15],[31,16,31,17],[31,18,31,19],[31,20,31,26],[31,27,31,30],[31,31,31,39],[32,1,32,2],[32,3,32,11],[32,12,32,13],[32,14,32,15],[32,16,32,17],[32,18,32,19],[32,20,32,26],[32,27,32,30],[32,31,32,39],[33,1,33,2],[33,3,33,11],[33,12,33,13],[33,14,33,15],[33,16,33,17],[33,18,33,19],[33,20,33,26],[33,27,33,30],[33,31,33,39],[34,1,34,2],[34,3,34,11],[34,12,34,13],[34,14,34,15],[34,16,34,17],[34,18,34,19],[34,20,34,26],[34,27,34,30],[34,31,34,39],[35,0,35,2],[35,3,35,5],[35,6,35,11],[35,12,35,13],[35,14,35,15],[35,16,35,17],[35,18,35,19],[35,20,35,26],[35,27,35,30],[35,31,35,39],[36,0,36,2],[36,3,36,11],[36,12,36,13],[36,14,36,15],[36,16,36,17],[36,18,36,19],[36,20,36,26],[36,27,36,30],[36,31,36,39],[37,0,37,39],[38,0,44,0],[38,1,39,5],[38,6,39,15],[38,16,39,26],[38,27,38,28],[38,29,38,30],[38,31,39,39],[40,1,40,5],[40,6,40,15],[40,16,40,26],[40,31,40,39],[41,1,41,5],[41,6,41,15],[41,16,41,26],[41,31,41,39],[42,1,42,5],[42,6,42,15],[42,16,42,26],[42,31,42,39],[43,1,43,5],[43,6,43,15],[43,16,43,26],[43,31,43,39],[44,1,44,5],[44,6,44,15],[44,16,44,26],[44,31,44,39],[45,0,45,39],[46,0,46,39],[47,0,47,11],[47,12,47,13],[47,14,47,15],[47,16,47,17],[47,18,47,20],[47,21,47,23],[47,24,47,26],[47,27,47,35],[47,36,47,39],[48,0,48,11],[48,12,48,13],[48,14,48,15],[48,16,48,17],[48,18,48,20],[48,21,48,23],[48,24,48,26],[48,27,48,35],[48,36,48,39],[49,0,49,39],[50,0,50,39],[51,0,51,39],[52,0,52,17],[52,18,52,19],[52,20,52,37],[52,38,52,39],[53,0,53,39],[54,0,54,7],[54,8,54,20],[54,21,57,25],[54,26,57,39],[55,0,55,7],[55,8,55,20],[56,0,56,7],[56,8,56,20],[57,0,57,7],[57,8,57,20],[58,0,58,7],[58,8,58,20],[58,21,58,25],[58,26,58,39],[59,0,59,39],[60,0,60,39],[61,0,61,17],[61,18,61,19],[61,20,61,37],[61,38,61,39],[62,0,62,17],[62,18,62,19],[62,20,63,37],[62,38,63,39],[63,0,63,17],[63,18,63,19],[64,0,64,9],[64,10,64,39],[65,0,69,9],[65,10,65,14],[65,15,65,39],[66,10,66,14],[66,15,66,39],[67,10,67,14],[67,15,67,39],[68,10,68,14],[68,15,68,39],[69,10,69,14],[69,15,69,39],[70,0,74,9],[70,10,70,14],[70,15,70,39],[71,10,71,14],[71,15,71,39],[72,10,72,14],[72,15,72,39],[73,10,73,14],[73,15,73,39],[74,10,74,14],[74,15,74,39],[75,0,79,9],[75,10,75,14],[75,15,75,34],[75,35,75,39],[76,10,76,14],[76,15,76,34],[76,35,76,39],[77,10,77,14],[77,15,77,34],[77,35,77,39],[78,10,78,14],[78,15,78,34],[78,35,78,39],[79,10,79,14],[79,15,79,34],[79,35,79,39],[80,0,80,7],[80,8,80,20],[80,21,83,25],[80,26,83,39],[81,0,81,7],[81,8,81,20],[82,0,82,7],[82,8,82,20],[83,0,83,7],[83,8,83,20],[84,0,84,7],[84,8,84,20],[84,21,84,25],[84,26,84,39]]}
[{"$f":"Sprachen!L392","v":"6.1 Deckblatt PPF Software"},{"$nulls":12},{"$f":"Sprachen!L378","v":"Bericht"},{"$nulls":6},{"$f":"IF(H4<>\"\",H4&\" / \"&H5,\"\")","v":""},{"$nulls":20},"Sprachauswahl",null,1,"Hardwarebemusterung erforderlich",{"$f":"IF(#REF!=Sprachen!L4,\"X\",\"N\")","v":{"$error":"#REF!"}},{"$nulls":6},"Optionales Template: Die Inhalte können auch in geeigneter Form auf andere Art nachgewiesen werden, \ndie spezifischen Inhalte sind zwischen Organisation und Kunde abzustimmen"]
[{"$nulls":13},{"$f":"Sprachen!L255","v":"Organisation"},{"$nulls":6},{"$f":"IF('Deckblatt '!U2<>\"\",'Deckblatt '!U2,\"\")","v":""},{"$nulls":23},"Softwarebemusterung erforderlich",{"$f":"IF(#REF!=Sprachen!L4,\"X\",\"N\")","v":{"$error":"#REF!"}}]
[{"$f":"Sprachen!L46","v":"Angaben zur Organisation"},{"$nulls":13},{"$f":"Sprachen!L433","v":"Angaben zur Software"},{"$nulls":12},{"$f":"Sprachen!L45","v":"Angaben zum Kunden"},{"$nulls":13},{"$f":"'Deckblatt '!AP2","v":"Deutsch"}]
[{"$f":"Sprachen!L75","v":"Berichtsnummer"},{"$nulls":6},{"$f":"IF('Deckblatt '!H16<>\"\",'Deckblatt '!H16,\"\")","v":""},{"$nulls":6},{"$f":"Sprachen!L437","v":"Stücklistenreferenz (Kunde)"},{"$nulls":12},{"$f":"Sprachen!L187","v":"Kunde"},{"$nulls":6},{"$f":"IF('Deckblatt '!A10<>\"\",'Deckblatt '!A10,\"\")","v":""}]
[{"$f":"Sprachen!L77","v":"Berichtsversion"},{"$nulls":6},{"$f":"IF('Deckblatt '!H17<>\"\",'Deckblatt '!H17,\"\")","v":""}]
[{"$f":"Sprachen!L199","v":"Lieferstandort"},{"$nulls":6},{"$f":"IF('Deckblatt '!H18<>\"\",'Deckblatt '!H18,\"\")","v":""},{"$nulls":19},{"$f":"Sprachen!L87","v":"Bestellnr. PPF-Muster"},{"$nulls":6},{"$f":"IF('Deckblatt '!AI18<>\"\",'Deckblatt '!AI18,\"\")","v":""}]
[{"$f":"Sprachen!L276","v":"Produktionsstandort"},{"$nulls":6},{"$f":"IF('Deckblatt '!H19<>\"\",'Deckblatt '!H19,\"\")","v":""},{"$nulls":19},{"$f":"Sprachen!L14","v":"Abladestelle"},{"$nulls":6},{"$f":"IF('Deckblatt '!AI19<>\"\",'Deckblatt '!AI19,\"\")","v":""}]
[{"$f":"Sprachen!L304","v":"Sachnummer"},{"$nulls":6},{"$f":"IF('Deckblatt '!H20<>\"\",'Deckblatt '!H20,\"\")","v":""},{"$nulls":19},{"$f":"Sprachen!L304","v":"Sachnummer"},{"$nulls":6},{"$f":"IF('Deckblatt '!AI20<>\"\",'Deckblatt '!AI20,\"\")","v":""}]
[{"$f":"Sprachen!L65","v":"Benennung"},{"$nulls":6},{"$f":"IF('Deckblatt '!H21<>\"\",'Deckblatt '!H21,\"\")","v":""},{"$nulls":19},{"$f":"Sprachen!L65","v":"Benennung"},{"$nulls":6},{"$f":"IF('Deckblatt '!AI21<>\"\",'Deckblatt '!AI21,\"\")","v":""}]
[{"$f":"Sprachen!L374","v":"Zeichnungsnummer"},{"$nulls":6},{"$f":"IF('Deckblatt '!H22<>\"\",'Deckblatt '!H22,\"\")","v":""},{"$nulls":19},{"$f":"Sprachen!L374","v":"Zeichnungsnummer"},{"$nulls":6},{"$f":"IF('Deckblatt '!AI22<>\"\",'Deckblatt '!AI22,\"\")","v":""}]
[{"$f":"Sprachen!L361","v":"Version/ Datum"},{"$nulls":6},{"$f":"IF('Deckblatt '!H23<>\"\",'Deckblatt '!H23,\"\")","v":""},{"$nulls":6},{"$f":"Sprachen!L177","v":"Kennung/DUNS"},{"$nulls":6},{"$f":"IF('Deckblatt '!V23<>\"\",'Deckblatt '!V23,\"\")","v":""},{"$nulls":5},{"$f":"Sprachen!L361","v":"Version/ Datum"},{"$nulls":6},{"$f":"IF('Deckblatt '!AI23<>\"\",'Deckblatt '!AI23,\"\")","v":""}]
[{"$f":"IF('PPF Abstimmung'!A38<>\"\",'PPF Abstimmung'!A38,\"\")","v":"Bauteil mit besonderer Archivierungspflicht"}]
[{"$f":"Sprachen!L434","v":"Beschreibung der Software"}]
[]
[{"$f":"Sprachen!L435","v":"Produktspezifischer Kenner/Schlüssel"},{"$nulls":20},{"$f":"Sprachen!L436","v":"Prüfsumme"}]
[]
[{"$f":"Sprachen!L402","v":"Angaben zu verwendeten Softwaremodulen (Eigen- und Fremdanteile sind aufzuführen)"}]
[{"$f":"Sprachen!L79","v":"Beschreibung"},{"$f":"Sprachen!L403","v":"Eigenständiges Softwarepaket"},null,{"$f":"Sprachen!L404","v":"HW-Verwendung"},{"$nulls":6},{"$f":"Sprachen!L405","v":"Softwarestand"},{"$nulls":3},{"$f":"Sprachen!L406","v":"Betriebssystem"},{"$nulls":3},{"$f":"Sprachen!L407","v":"Diagnoseerkennung"},{"$nulls":3},{"$f":"Sprachen!L408","v":"ASIL-Einstufung"},{"$nulls":3},{"$f":"Sprachen!L409","v":"Kompa-tibilität zur Spezifi-kation"},null,{"$f":"Sprachen!L412","v":"(6.6) FOSS-Freigabe"},null,null,{"$f":"Sprachen!L61","v":"Bemerkung"}]
[{"$nulls":26},{"$f":"Sprachen!L410","v":"erfüllt"},{"$f":"Sprachen!L411","v":"nicht erfüllt"},{"$f":"Sprachen!L413","v":"liegt vor"},{"$f":"Sprachen!L414","v":"liegt nicht vor"},{"$f":"Sprachen!L415","v":"nicht relevant"}]
[]
[]
[]
[{"$f":"Sprachen!L416","v":"Auslöser"},null,null,{"$f":"Sprachen!L417","v":"Initiales PPF-Verfahren"}]
[{"$nulls":3},{"$f":"Sprachen!L418","v":"PPF-Verfahren aufgrund von Änderungen"}]
[{"$f":"Sprachen!L311","v":"Selbstbeurteilung Organisation"}]
[{"$f":"Sprachen!L423","v":"Spezifikation und Nachweise"},{"$f":"Sprachen!L253","v":"Ordnungs-    nummer"},null,{"$f":"Sprachen!L289","v":"Prüfgebiet"},null,null,{"$f":"Sprachen!L12","v":"(sofern für das Produkt zutreffend)"},{"$nulls":5},{"$f":"Sprachen!L366","v":"Vorlage erforderlich"},null,{"$f":"Sprachen!L43","v":"Anforderungen vollständig erfüllt"},null,{"$f":"Sprachen!L42","v":"Anforderungen nicht vollständig erfüllt"},null,{"$f":"Sprachen!L419","v":"Anforderung nicht erfüllt"},null,{"$f":"Sprachen!L224","v":"Nachweis-      \ndokument"},{"$nulls":6},{"$f":"Sprachen!L361","v":"Version/ Datum"},{"$nulls":3},{"$f":"Sprachen!L61","v":"Bemerkung"}]
[null,"6.2",null,{"$f":"Sprachen!L138","v":"Festlegung des Kontextes („Scope“) des zu liefernden Softwareproduktes"},{"$nulls":8},{"$f":"Sprachen!L4","v":"Ja"},{"$nulls":27},{"$f":"IF(O27<>\"\",1)","v":false},{"$f":"IF(Q27<>\"\",1)","v":false},{"$f":"IF(S27<>\"\",1)","v":false},{"$f":"SUM(AO27:AQ27)","v":0},{"$f":"AND(M27=Sprachen!$L$4,AR27=0)","v":true},{"$f":"IF(M27=Sprachen!$L$4,1,0)","v":1},{"$f":"SUM(AT27:AT37)","v":4},{"$f":"SUM(AO27:AO37)","v":0},{"$f":"SUM(AP27:AP37)","v":0},{"$f":"SUM(AQ27:AQ37)","v":0},{"$f":"IF(AND(AU27=SUM(AO27:AP28),AU27>0),IF(AU27=AV27,1,2),0)","v":0}]
[null,"6.3",null,{"$f":"Sprachen!L297","v":"Referenz zu vertraglich festgelegten Qualitätsanforderungen\n(z. B. Coding Guidelines, Codemetriken, Testabdeckung)"},{"$nulls":8},{"$f":"Sprachen!L4","v":"Ja"},{"$nulls":27},false,false,{"$f":"IF(S28<>\"\",1)","v":false},{"$f":"SUM(AO28:AQ28)","v":0},{"$f":"AND(M28=Sprachen!$L$4,AR28=0)","v":true},{"$f":"IF(M28=Sprachen!$L$4,1,0)","v":1}]
[null,"6.4",null,{"$f":"Sprachen!L105","v":"Dokumentation der technischen SW-Spezifikationen"},{"$nulls":8},{"$f":"IF('PPF Abstimmung'!O202<>\"\",'PPF Abstimmung'!O202,\"\")","v":""},{"$nulls":27},false,false,false,0,{"$f":"AND(M29=Sprachen!$L$4,AR29=0)","v":false},{"$f":"IF(M29=Sprachen!$L$4,1,0)","v":0}]
[null,"6.5",null,{"$f":"Sprachen!L223","v":"Nachweis Umsetzung der Anforderungen 6.3 u. 6.4"},{"$nulls":8},{"$f":"IF('PPF Abstimmung'!O203<>\"\",'PPF Abstimmung'!O203,\"\")","v":""},{"$nulls":27},false,false,false,0,{"$f":"AND(M30=Sprachen!$L$4,AR30=0)","v":false},{"$f":"IF(M30=Sprachen!$L$4,1,0)","v":0}]
[null,"6.6",null,{"$f":"Sprachen!L111","v":"Dokumentation über FOSS (Free-and-Open-Source-Software)"},{"$nulls":8},{"$f":"Sprachen!L4","v":"Ja"},{"$nulls":27},false,false,false,0,{"$f":"AND(M31=Sprachen!$L$4,AR31=0)","v":true},{"$f":"IF(M31=Sprachen!$L$4,1,0)","v":1}]
[null,"6.7",null,{"$f":"Sprachen!L200","v":"Liste bekannter Fehler "},{"$nulls":8},{"$f":"Sprachen!L4","v":"Ja"},{"$nulls":27},false,false,false,0,{"$f":"AND(M32=Sprachen!$L$4,AR32=0)","v":true},{"$f":"IF(M32=Sprachen!$L$4,1,0)","v":1}]
[null,"6.8",null,{"$f":"Sprachen!L108","v":"Dokumentation der während der gesamten Projektlaufzeit eingesetzten Entwicklungswerkzeuge"},{"$nulls":8},{"$f":"IF('PPF Abstimmung'!O206<>\"\",'PPF Abstimmung'!O206,\"\")","v":""},{"$nulls":27},false,false,false,0,{"$f":"AND(M33=Sprachen!$L$4,AR33=0)","v":false},{"$f":"IF(M33=Sprachen!$L$4,1,0)","v":0}]
[null,"6.9",null,{"$f":"Sprachen!L109","v":"Dokumentation der während der gesamten Projektlaufzeit eingesetzten Testwerkzeuge"},{"$nulls":8},{"$f":"IF('PPF Abstimmung'!O207<>\"\",'PPF Abstimmung'!O207,\"\")","v":""},{"$nulls":27},false,false,false,0,{"$f":"AND(M34=Sprachen!$L$4,AR34=0)","v":false},{"$f":"IF(M34=Sprachen!$L$4,1,0)","v":0}]
[null,"6.10",null,{"$f":"Sprachen!L110","v":"Dokumentation des Versionsmanagements (Baseline, Konfigurationen, Änderungshistorie)"},{"$nulls":8},{"$f":"IF('PPF Abstimmung'!O208<>\"\",'PPF Abstimmung'!O208,\"\")","v":""},{"$nulls":27},false,false,false,0,{"$f":"AND(M35=Sprachen!$L$4,AR35=0)","v":false},{"$f":"IF(M35=Sprachen!$L$4,1,0)","v":0}]
[{"$f":"Sprachen!L253","v":"Ordnungs-    nummer"},null,null,{"$f":"Sprachen!L289","v":"Prüfgebiet"},null,null,{"$f":"Sprachen!L12","v":"(sofern für das Produkt zutreffend)"},{"$nulls":5},{"$f":"Sprachen!L366","v":"Vorlage erforderlich"},null,{"$f":"Sprachen!L43","v":"Anforderungen vollständig erfüllt"},null,{"$f":"Sprachen!L42","v":"Anforderungen nicht vollständig erfüllt"},null,{"$f":"Sprachen!L419","v":"Anforderung nicht erfüllt"},null,{"$f":"Sprachen!L421","v":"Methode zur Prozessbewertung"},{"$nulls":6},{"$f":"Sprachen!L420","v":"Datum der letzten Prozessbewertung"},{"$nulls":3},{"$f":"Sprachen!L422","v":"Ergebnis der Prozessbewertung"}]
["6.11",null,null,{"$f":"Sprachen!L221","v":"Nachweis einer Prozessbewertung (z. B. Automotive Spice)"},{"$nulls":8},{"$f":"IF('PPF Abstimmung'!O209<>\"\",'PPF Abstimmung'!O209,\"\")","v":""},{"$nulls":27},false,false,false,0,{"$f":"AND(M37=Sprachen!$L$4,AR37=0)","v":false},{"$f":"IF(M37=Sprachen!$L$4,1,0)","v":0}]
[{"$f":"Sprachen!L424","v":"Details zur Verwendung von Softwaremodulen"}]
[{"$f":"Sprachen!L424","v":"Details zur Verwendung von Softwaremodulen"},{"$f":"Sprachen!L425","v":"SW-SNR"},{"$nulls":4},{"$f":"Sprachen!L426","v":"Benennung des Kunden"},{"$nulls":9},{"$f":"Sprachen!L427","v":"Bezeichnung der Organisation"},{"$nulls":10},{"$f":"Sprachen!L428","v":"Testreport"},null,{"$f":"Sprachen!A429","v":"Freigabestatus"},null,{"$f":"Sprachen!L61","v":"Bemerkung"},{"$nulls":14},{"$f":"IF(AX27>0,\"X\",\"\")","v":""}]
[{"$nulls":27},{"$f":"Sprachen!L413","v":"liegt vor"},{"$f":"Sprachen!L414","v":"liegt nicht vor"},{"$f":"Sprachen!L413","v":"liegt vor"},{"$f":"Sprachen!L414","v":"liegt nicht vor"}]
[]
[]
[]
[]
[]
[{"$f":"Sprachen!L430","v":"Einsatzempfehlung der Organisation"}]
[{"$f":"Sprachen!L431","v":"(Von einer autorisierten Person bei der Organisation durch rechtsverbindliche Unterschrift [schriftlich, elektronisch] gegebene Erlaubnis, die Software für den vorgesehenen Einsatzzweck zu benutzen)"}]
[{"$f":"Sprachen!L233","v":"Nachweiskategorie"},{"$nulls":11},{"$f":"Sprachen!L366","v":"Vorlage erforderlich"},null,{"$f":"Sprachen!L43","v":"Anforderungen vollständig erfüllt"},null,{"$f":"Sprachen!L42","v":"Anforderungen nicht vollständig erfüllt"},null,{"$f":"Sprachen!L268","v":"PPF-Verfahren zum Kunden abgeschlossen"},null,null,{"$f":"Sprachen!L25","v":"Aktualisierte PPF-Dokumentation erforderlich"},null,null,{"$f":"Sprachen!L238","v":"Neues PPF-Verfahren erforderlich"},null,null,{"$f":"Sprachen!L302","v":"Risikobewertung"},{"$nulls":8},{"$f":"Sprachen!L361","v":"Version/ Datum"}]
[{"$f":"Sprachen!L323","v":"Nachweise zur Software"},{"$nulls":11},{"$f":"Sprachen!L4","v":"Ja"},null,{"$f":"IF(AND(AW27=0,AX27=0,AU27=AV27),\"X\",\"\")","v":""},null,{"$f":"IF(AND(AV27<AU27,AX27=0,AU27=(AV27+AW27)),\"X\",\"\")","v":""}]
[{"$f":"Sprachen!L181","v":"Kommentar Organisation"}]
[]
[{"$f":"Sprachen!L122","v":"Empfehlung durch die Organisation"}]
[{"$f":"Sprachen!L191","v":"Kundentauglich/Serientauglich"},{"$nulls":17},{"$f":"IF(AND(AW27=0,AX27=0,AU27=AV27),\"X\",\"\")","v":""},null,{"$f":"Sprachen!L242","v":"Nicht kundentauglich/ \nNicht serientauglich"},{"$nulls":17},{"$f":"IF(AX27>0,\"X\",\"\")","v":""}]
[{"$f":"Sprachen!L84","v":"Bestätigung Organisation"}]
[{"$f":"Sprachen!L234","v":"Name"},{"$nulls":7},{"$f":"IF('Selbstb. Produkt '!I28<>\"\",'Selbstb. Produkt '!I28,\"\")","v":""},{"$nulls":12},{"$f":"Sprachen!L61","v":"Bemerkung"}]
[{"$f":"Sprachen!L20","v":"Abteilung"},{"$nulls":7},{"$f":"IF('Selbstb. Produkt '!I29<>\"\",'Selbstb. Produkt '!I29,\"\")","v":""}]
[{"$f":"Sprachen!L343","v":"Telefon"},{"$nulls":7},{"$f":"IF('Selbstb. Produkt '!I30<>\"\",'Selbstb. Produkt '!I30,\"\")","v":""}]
[{"$f":"Sprachen!L119","v":"E-Mail/Fax-Nr."},{"$nulls":7},{"$f":"IF('Selbstb. Produkt '!I31<>\"\",'Selbstb. Produkt '!I31,\"\")","v":""}]
[{"$f":"Sprachen!L91","v":"Datum"},{"$nulls":7},{"$f":"IF('Selbstb. Produkt '!I32<>\"\",'Selbstb. Produkt '!I32,\"\")","v":""},{"$nulls":12},{"$f":"Sprachen!L348","v":"Unterschrift"}]
[{"$f":"Sprachen!L124","v":"Entscheidung Kunde"}]
[{"$f":"Sprachen!L432","v":"(Von einer autorisierten Person beim Kunden durch rechtsverbindliche Unterschrift [schriftlich, elektronisch] gegebene Erlaubnis, die Software für den vorgesehenen Einsatzzweck zu benutzen)"}]
[{"$f":"Sprachen!L191","v":"Kundentauglich/Serientauglich"},{"$nulls":19},{"$f":"Sprachen!L243","v":"Nicht kundentauglich/\n Nicht serientauglich"}]
[{"$f":"Sprachen!L268","v":"PPF-Verfahren zum Kunden abgeschlossen"},{"$nulls":19},{"$f":"Sprachen!L238","v":"Neues PPF-Verfahren erforderlich"},{"$nulls":19},{"$f":"COUNTIF(S63:T64,\"X\")+COUNTIF(AM63,\"X\")","v":0}]
[{"$f":"Sprachen!L25","v":"Aktualisierte PPF-Dokumentation erforderlich"}]
[{"$f":"Sprachen!L21","v":"Abweichende Einschätzung des Kunden gegenüber der Organisation"}]
[{"$f":"Sprachen!L219","v":"Nachforderung \nVorzulegende Dokumente zu offenen Prüfgebieten"},{"$nulls":9},{"$f":"Sprachen!L289","v":"Prüfgebiet"},{"$nulls":4},{"$f":"Sprachen!L220","v":"Nachforderung/Begründung"}]
[]
[]
[]
[]
[{"$f":"Sprachen!L29","v":"Akzeptanz von Abweichungen \n(ohne Anpassung weiterer Dokumente)"},{"$nulls":9},{"$f":"Sprachen!L289","v":"Prüfgebiet"},{"$nulls":4},{"$f":"Sprachen!L237","v":"Neue Spezifikation"}]
[]
[]
[]
[]
[{"$f":"Sprachen!L23","v":"Abweich-          genehmigung"},{"$nulls":9},{"$f":"Sprachen!L289","v":"Prüfgebiet"},{"$nulls":4},{"$f":"Sprachen!L22","v":"Abweichgenehmigung"},{"$nulls":19},{"$f":"Sprachen!L160","v":"Gültigkeit"}]
[]
[]
[]
[]
[{"$f":"Sprachen!L234","v":"Name"},{"$nulls":7},{"$f":"IF('PPF Abstimmung'!I270<>\"\",'PPF Abstimmung'!I270,\"\")","v":""},{"$nulls":12},{"$f":"Sprachen!L61","v":"Bemerkung"}]
[{"$f":"Sprachen!L20","v":"Abteilung"},{"$nulls":7},{"$f":"IF('PPF Abstimmung'!I271<>\"\",'PPF Abstimmung'!I271,\"\")","v":""}]
[{"$f":"Sprachen!L343","v":"Telefon"},{"$nulls":7},{"$f":"IF('PPF Abstimmung'!I272<>\"\",'PPF Abstimmung'!I272,\"\")","v":""}]
[{"$f":"Sprachen!L119","v":"E-Mail/Fax-Nr."},{"$nulls":7},{"$f":"IF('PPF Abstimmung'!I273<>\"\",'PPF Abstimmung'!I273,\"\")","v":""}]
[{"$f":"Sprachen!L91","v":"Datum"},{"$nulls":7},{"$f":"IF('PPF-Bewertung'!I149<>\"\",'PPF-Bewertung'!I149,\"\")","v":""},{"$nulls":12},{"$f":"Sprachen!L348","v":"Unterschrift"}]

{"sheet":"Anlage 5 Deckblatt Software 2","index":10,"n_rows":55,"n_cols":53,"rows_kept":55,"hidden":true,"merged":[[0,0,1,12],[0,13,0,19],[0,20,0,39],[1,13,1,19],[1,20,1,39],[2,0,2,13],[2,14,2,26],[2,27,2,39],[3,0,3,6],[3,7,3,13],[3,14,4,20],[3,21,4,26],[3,27,4,33],[3,34,4,39],[4,0,4,6],[4,7,4,13],[5,0,5,6],[5,7,5,13],[5,14,5,20],[5,21,5,26],[5,27,5,33],[5,34,5,39],[6,0,6,6],[6,7,6,13],[6,14,6,20],[6,21,6,26],[6,27,6,33],[6,34,6,39],[7,0,7,6],[7,7,7,13],[7,14,7,20],[7,21,7,26],[7,27,7,33],[7,34,7,39],[8,0,8,6],[8,7,8,13],[8,14,8,20],[8,21,8,26],[8,27,8,33],[8,34,8,39],[9,0,9,6],[9,7,9,13],[9,14,9,20],[9,21,9,26],[9,27,9,33],[9,34,9,39],[10,0,10,6],[10,7,10,13],[10,14,10,20],[10,21,10,26],[10,27,10,33],[10,34,10,39],[11,0,11,13],[12,0,12,39],[13,0,13,39],[14,0,14,6],[14,8,14,17],[14,19,14,28],[14,30,14,39],[15,0,15,6],[15,8,15,17],[15,19,15,28],[15,30,15,39],[16,0,16,6],[16,8,16,17],[16,19,16,28],[16,30,16,39],[17,0,17,39],[18,0,18,10],[18,11,18,15],[18,16,18,20],[18,21,18,25],[18,26,18,30],[18,31,18,39],[19,0,19,10],[19,11,19,15],[19,16,19,20],[19,21,19,25],[19,26,19,30],[19,31,19,39],[20,0,20,10],[20,11,20,15],[20,16,20,20],[20,21,20,25],[20,26,20,30],[20,31,20,39],[21,0,21,10],[21,11,21,15],[21,16,21,20],[21,21,21,25],[21,26,21,30],[21,31,21,39],[22,0,22,10],[22,11,22,15],[22,16,22,20],[22,21,22,25],[22,26,22,30],[22,31,22,39],[23,0,23,10],[23,11,23,15],[23,16,23,20],[23,21,23,25],[23,26,23,30],[23,31,23,39],[24,0,24,10],[24,11,24,15],[24,16,24,20],[24,21,24,25],[24,26,24,30],[24,31,24,39],[25,0,25,10],[25,11,25,15],[25,16,25,20],[25,21,25,25],[25,26,25,30],[25,31,25,39],[26,0,26,10],[26,11,26,15],[26,16,26,20],[26,21,26,25],[26,26,26,30],[26,31,26,39],[27,0,27,10],[27,11,27,15],[27,16,27,20],[27,21,27,25],[27,26,27,30],[27,31,27,39],[28,0,28,39],[29,0,29,10],[29,11,29,15],[29,16,29,20],[29,21,29,25],[29,26,29,30],[29,31,29,39],[30,0,30,10],[30,11,30,15],[30,16,30,20],[30,21,30,25],[30,26,30,30],[30,31,30,39],[31,0,31,10],[31,11,31,15],[31,16,31,20],[31,21,31,25],[31,26,31,30],[31,31,31,39],[32,0,32,10],[32,11,32,15],[32,16,32,20],[32,21,32,25],[32,26,32,30],[32,31,32,39],[33,0,33,10],[33,11,33,15],[33,16,33,20],[33,21,33,25],[33,26,33,30],[33,31,33,39],[34,0,34,10],[34,11,34,15],[34,16,34,20],[34,21,34,25],[34,26,34,30],[34,31,34,39],[35,0,35,10],[35,11,35,15],[35,16,35,20],[35,21,35,25],[35,26,35,30],[35,31,35,39],[36,0,36,1],[36,2,36,39],[37,0,38,7],[37,8,37,20],[37,21,38,28],[37,29,37,39],[38,8,38,20],[38,29,38,39],[39,0,39,1],[39,2,39,39],[40,0,41,7],[40,8,40,20],[40,21,41,28],[40,29,40,39],[41,8,41,20],[41,29,41,39],[42,0,42,39],[43,0,43,7],[43,8,43,11],[43,12,43,24],[43,25,43,30],[43,31,43,39],[44,0,44,16],[44,17,44,19],[44,20,44,36],[44,37,44,39],[45,0,45,7],[45,8,45,11],[45,12,45,24],[45,25,45,30],[45,31,45,39],[46,0,46,7],[46,8,46,11],[46,12,46,24],[46,25,46,30],[46,31,46,39],[47,0,47,7],[47,8,47,11],[47,12,47,24],[47,25,47,30],[47,31,47,39],[48,0,48,39],[49,0,49,39],[50,0,50,7],[50,8,50,20],[50,21,53,25],[50,26,53,39],[51,0,51,7],[51,8,51,20],[52,0,52,7],[52,8,52,20],[53,0,53,7],[53,8,53,20],[54,0,54,7],[54,8,54,20],[54,21,54,25],[54,26,54,39]]}
[{"$f":"Sprachen!L392","v":"6.1 Deckblatt PPF Software"},{"$nulls":12},{"$f":"Sprachen!L378","v":"Bericht"},{"$nulls":6},{"$f":"IF(H4<>\"\",H4&\" / \"&H5,\"\")","v":""},{"$nulls":20},"Sprachauswahl",null,1,"Hardwarebemusterung erforderlich",{"$f":"IF(#REF!=Sprachen!L4,\"X\",\"N\")","v":{"$error":"#REF!"}},{"$nulls":6},"Optionales Template: Die Inhalte können auch in geeigneter Form auf andere Art nachgewiesen werden, \ndie spezifischen Inhalte sind zwischen Organisation und Kunde abzustimmen"]
[{"$nulls":13},{"$f":"Sprachen!L255","v":"Organisation"},{"$nulls":6},{"$f":"IF('Deckblatt '!U2<>\"\",'Deckblatt '!U2,\"\")","v":""},{"$nulls":23},"Softwarebemusterung erforderlich",{"$f":"IF(#REF!=Sprachen!L4,\"X\",\"N\")","v":{"$error":"#REF!"}}]
[{"$f":"Sprachen!L46","v":"Angaben zur Organisation"},{"$nulls":13},{"$f":"Sprachen!L433","v":"Angaben zur Software"},{"$nulls":12},{"$f":"Sprachen!L45","v":"Angaben zum Kunden"},{"$nulls":13},{"$f":"'Deckblatt '!AP2","v":"Deutsch"}]
[{"$f":"Sprachen!L75","v":"Berichtsnummer"},{"$nulls":6},{"$f":"IF('Deckblatt '!H16<>\"\",'Deckblatt '!H16,\"\")","v":""},{"$nulls":6},{"$f":"Sprachen!L437","v":"Stücklistenreferenz (Kunde)"},{"$nulls":6},{"$f":"IF('Anlage 5 Deckblatt Software 1'!V4<>\"\",'Anlage 5 Deckblatt Software 1'!V4,\"\")","v":""},{"$nulls":5},{"$f":"Sprachen!L187","v":"Kunde"},{"$nulls":6},{"$f":"IF('Deckblatt '!A10<>\"\",'Deckblatt '!A10,\"\")","v":""}]
[{"$f":"Sprachen!L77","v":"Berichtsversion"},{"$nulls":6},{"$f":"IF('Deckblatt '!H17<>\"\",'Deckblatt '!H17,\"\")","v":""}]
[{"$f":"Sprachen!L199","v":"Lieferstandort"},{"$nulls":6},{"$f":"IF('Deckblatt '!H18<>\"\",'Deckblatt '!H18,\"\")","v":""},{"$nulls":19},{"$f":"Sprachen!L87","v":"Bestellnr. PPF-Muster"},{"$nulls":6},{"$f":"IF('Deckblatt '!AI18<>\"\",'Deckblatt '!AI18,\"\")","v":""}]
[{"$f":"Sprachen!L276","v":"Produktionsstandort"},{"$nulls":6},{"$f":"IF('Deckblatt '!H19<>\"\",'Deckblatt '!H19,\"\")","v":""},{"$nulls":19},{"$f":"Sprachen!L14","v":"Abladestelle"},{"$nulls":6},{"$f":"IF('Deckblatt '!AI19<>\"\",'Deckblatt '!AI19,\"\")","v":""}]
[{"$f":"Sprachen!L304","v":"Sachnummer"},{"$nulls":6},{"$f":"IF('Deckblatt '!H20<>\"\",'Deckblatt '!H20,\"\")","v":""},{"$nulls":19},{"$f":"Sprachen!L304","v":"Sachnummer"},{"$nulls":6},{"$f":"IF('Deckblatt '!AI20<>\"\",'Deckblatt '!AI20,\"\")","v":""}]
[{"$f":"Sprachen!L65","v":"Benennung"},{"$nulls":6},{"$f":"IF('Deckblatt '!H21<>\"\",'Deckblatt '!H21,\"\")","v":""},{"$nulls":19},{"$f":"Sprachen!L65","v":"Benennung"},{"$nulls":6},{"$f":"IF('Deckblatt '!AI21<>\"\",'Deckblatt '!AI21,\"\")","v":""}]
[{"$f":"Sprachen!L374","v":"Zeichnungsnummer"},{"$nulls":6},{"$f":"IF('Deckblatt '!H22<>\"\",'Deckblatt '!H22,\"\")","v":""},{"$nulls":19},{"$f":"Sprachen!L374","v":"Zeichnungsnummer"},{"$nulls":6},{"$f":"IF('Deckblatt '!AI22<>\"\",'Deckblatt '!AI22,\"\")","v":""}]
[{"$f":"Sprachen!L361","v":"Version/ Datum"},{"$nulls":6},{"$f":"IF('Deckblatt '!H23<>\"\",'Deckblatt '!H23,\"\")","v":""},{"$nulls":6},{"$f":"Sprachen!L177","v":"Kennung/DUNS"},{"$nulls":6},{"$f":"IF('Deckblatt '!V23<>\"\",'Deckblatt '!V23,\"\")","v":""},{"$nulls":5},{"$f":"Sprachen!L361","v":"Version/ Datum"},{"$nulls":6},{"$f":"IF('Deckblatt '!AI23<>\"\",'Deckblatt '!AI23,\"\")","v":""}]
[{"$f":"IF('PPF Abstimmung'!A38<>\"\",'PPF Abstimmung'!A38,\"\")","v":"Bauteil mit besonderer Archivierungspflicht"}]
[{"$f":"Sprachen!L438","v":"Durchgeführte Prüfungen"}]
[{"$f":"Sprachen!L439","v":"Allgemeine Angaben zur Hardware (Mindestanforderung)"}]
[{"$f":"Sprachen!L440","v":"Prozessor"},{"$nulls":6},"1.",{"$nulls":10},"2.",{"$nulls":10},"3."]
[{"$f":"Sprachen!L441","v":"Prozessorfrequenz"},{"$nulls":6},"1.",{"$nulls":10},"2.",{"$nulls":10},"3."]
[{"$f":"Sprachen!L442","v":"Quarzfrequenz"},{"$nulls":6},"1.",{"$nulls":10},"2.",{"$nulls":10},"3."]
[{"$f":"Sprachen!L443","v":"Speicherauslastung (Messung)"}]
[{"$f":"Sprachen!L444","v":"Komponente"},{"$nulls":10},{"$f":"Sprachen!L445","v":"Belegt [kB]"},{"$nulls":4},{"$f":"Sprachen!L446","v":"Verfügbar [kB]"},{"$nulls":4},{"$f":"Sprachen!L447","v":"Belegt [%]"},{"$nulls":4},{"$f":"Sprachen!L452","v":"Spezifikation erfüllt"},{"$nulls":4},{"$f":"Sprachen!L61","v":"Bemerkung"}]
[{"$f":"Sprachen!L448","v":"ROM"}]
[{"$f":"Sprachen!L449","v":"RAM"}]
[{"$f":"Sprachen!L450","v":"EEPROM"}]
[{"$f":"Sprachen!L451","v":"Harddisk"}]
[]
[]
[]
[]
[]
[{"$f":"Sprachen!L457","v":"Prozessorauslastung (Messung)"}]
[{"$f":"Sprachen!L444","v":"Komponente"},{"$nulls":10},{"$f":"Sprachen!L453","v":"Prozessorlast Initial"},{"$nulls":4},{"$f":"Sprachen!L454","v":"Prozessorlast Betrieb"},{"$nulls":4},{"$f":"Sprachen!L455","v":"Prozessorlast Peak"},{"$nulls":4},{"$f":"Sprachen!L452","v":"Spezifikation erfüllt"},{"$nulls":4},{"$f":"Sprachen!L61","v":"Bemerkung"}]
[{"$f":"Sprachen!L456","v":"Prozessorauslastung"}]
[]
[]
[]
[]
[]
["6.9",null,{"$f":"Sprachen!L109","v":"Dokumentation der während der gesamten Projektlaufzeit eingesetzten Testwerkzeuge"}]
[{"$f":"Sprachen!L458","v":"Referenz zur Dokumentation"},{"$nulls":7},{"$f":"Sprachen!L460","v":"Zugrundeliegende Konfiguration/Baseline"},{"$nulls":12},{"$f":"Sprachen!L459","v":"Stand der Dokumentation"},{"$nulls":7},{"$f":"Sprachen!L461","v":"Review und Freigabe letzter Stand"}]
[]
["6.10",null,{"$f":"Sprachen!L110","v":"Dokumentation des Versionsmanagements (Baseline, Konfigurationen, Änderungshistorie)"}]
[{"$f":"Sprachen!L458","v":"Referenz zur Dokumentation"},{"$nulls":7},{"$f":"Sprachen!L460","v":"Zugrundeliegende Konfiguration/Baseline"},{"$nulls":12},{"$f":"Sprachen!L459","v":"Stand der Dokumentation"},{"$nulls":7},{"$f":"Sprachen!L461","v":"Review und Freigabe letzter Stand"}]
[]
[{"$f":"Sprachen!L462","v":"Funktionstests Softwarepaket"}]
[{"$f":"Sprachen!L463","v":"Geprüft nach Testspezifikation"},{"$nulls":7},{"$f":"Sprachen!L224","v":"Nachweis-      \ndokument"},{"$nulls":16},{"$f":"Sprachen!L361","v":"Version/ Datum"}]
[{"$f":"Sprachen!L464","v":"Alle Testsequenzen bestanden? "},{"$nulls":19},{"$f":"Sprachen!L465","v":"Alle Regressionstest bestanden? "}]
[{"$f":"Sprachen!L466","v":"Liste nicht bestandener Tests und Risikobewertung"},{"$nulls":7},{"$f":"Sprachen!L224","v":"Nachweis-      \ndokument"},{"$nulls":16},{"$f":"Sprachen!L361","v":"Version/ Datum"}]
[{"$f":"Sprachen!L467","v":"Nachweis der Wirksamkeit der durchgeführten Maßnahmen"},{"$nulls":7},{"$f":"Sprachen!L224","v":"Nachweis-      \ndokument"},{"$nulls":16},{"$f":"Sprachen!L361","v":"Version/ Datum"}]
[{"$f":"Sprachen!L468","v":"Welche Sonderfreigaben liegen vor?"},{"$nulls":7},{"$f":"Sprachen!L224","v":"Nachweis-      \ndokument"},{"$nulls":16},{"$f":"Sprachen!L361","v":"Version/ Datum"}]
[{"$f":"Sprachen!L84","v":"Bestätigung Organisation"}]
[{"$f":"Sprachen!L469","v":"Nachweise zur Freigabe können jederzeit durch den Kunden eingesehen werden."}]
[{"$f":"Sprachen!L234","v":"Name"},{"$nulls":7},{"$f":"IF('Selbstb. Produkt '!I28<>\"\",'Selbstb. Produkt '!I28,\"\")","v":""},{"$nulls":12},{"$f":"Sprachen!L61","v":"Bemerkung"}]
[{"$f":"Sprachen!L20","v":"Abteilung"},{"$nulls":7},{"$f":"IF('Selbstb. Produkt '!I29<>\"\",'Selbstb. Produkt '!I29,\"\")","v":""}]
[{"$f":"Sprachen!L343","v":"Telefon"},{"$nulls":7},{"$f":"IF('Selbstb. Produkt '!I30<>\"\",'Selbstb. Produkt '!I30,\"\")","v":""}]
[{"$f":"Sprachen!L119","v":"E-Mail/Fax-Nr."},{"$nulls":7},{"$f":"IF('Selbstb. Produkt '!I31<>\"\",'Selbstb. Produkt '!I31,\"\")","v":""}]
[{"$f":"Sprachen!L91","v":"Datum"},{"$nulls":7},{"$f":"IF('Selbstb. Produkt '!I32<>\"\",'Selbstb. Produkt '!I32,\"\")","v":""},{"$nulls":12},{"$f":"Sprachen!L348","v":"Unterschrift"}]

{"sheet":"Anlage 6 Teilelebenslauf","index":11,"n_rows":25,"n_cols":59,"rows_kept":25,"hidden":true,"merged":[[0,0,0,16383],[1,0,2,12],[1,13,1,44],[1,45,1,47],[1,48,1,50],[1,51,1,53],[1,54,1,56],[2,13,2,36],[2,37,2,56],[3,0,3,27],[3,28,3,56],[4,0,4,6],[4,7,4,13],[4,14,4,20],[4,21,4,27],[4,28,6,34],[4,35,4,43],[4,44,4,50],[4,51,4,56],[5,0,5,6],[5,7,5,13],[5,14,5,20],[5,21,5,27],[5,35,6,43],[5,44,5,50],[5,51,5,56],[6,0,6,6],[6,7,6,13],[6,14,6,20],[6,21,6,27],[6,44,6,50],[6,51,6,56],[7,0,8,2],[7,3,8,4],[7,5,8,9],[7,10,8,11],[7,12,8,16],[7,17,7,19],[7,20,8,30],[7,31,8,34],[7,35,8,38],[7,39,8,44],[7,45,8,50],[7,51,8,56],[9,0,9,2],[9,3,9,4],[9,5,9,9],[9,10,9,11],[9,12,9,16],[9,20,9,30],[9,31,9,34],[9,35,9,38],[9,39,9,44],[9,45,9,50],[9,51,9,56],[10,0,10,2],[10,3,10,4],[10,5,10,9],[10,10,10,11],[10,12,10,16],[10,20,10,30],[10,31,10,34],[10,35,10,38],[10,39,10,44],[10,45,10,50],[10,51,10,56],[11,0,11,2],[11,3,11,4],[11,5,11,9],[11,10,11,11],[11,12,11,16],[11,20,11,30],[11,31,11,34],[11,35,11,38],[11,39,11,44],[11,45,11,50],[11,51,11,56],[12,0,12,2],[12,3,12,4],[12,5,12,9],[12,10,12,11],[12,12,12,16],[12,20,12,30],[12,31,12,34],[12,35,12,38],[12,39,12,44],[12,45,12,50],[12,51,12,56],[13,0,13,2],[13,3,13,4],[13,5,13,9],[13,10,13,11],[13,12,13,16],[13,20,13,30],[13,31,13,34],[13,35,13,38],[13,39,13,44],[13,45,13,50],[13,51,13,56],[14,0,14,2],[14,3,14,4],[14,5,14,9],[14,10,14,11],[14,12,14,16],[14,20,14,30],[14,31,14,34],[14,35,14,38],[14,39,14,44],[14,45,14,50],[14,51,14,56],[15,0,15,2],[15,3,15,4],[15,5,15,9],[15,10,15,11],[15,12,15,16],[15,20,15,30],[15,31,15,34],[15,35,15,38],[15,39,15,44],[15,45,15,50],[15,51,15,56],[16,0,16,2],[16,3,16,4],[16,5,16,9],[16,10,16,11],[16,12,16,16],[16,20,16,30],[16,31,16,34],[16,35,16,38],[16,39,16,44],[16,45,16,50],[16,51,16,56],[17,0,17,2],[17,3,17,4],[17,5,17,9],[17,10,17,11],[17,12,17,16],[17,20,17,30],[17,31,17,34],[17,35,17,38],[17,39,17,44],[17,45,17,50],[17,51,17,56],[18,0,18,2],[18,3,18,4],[18,5,18,9],[18,10,18,11],[18,12,18,16],[18,20,18,30],[18,31,18,34],[18,35,18,38],[18,39,18,44],[18,45,18,50],[18,51,18,56],[19,0,19,56],[20,0,20,7],[20,8,20,37],[20,38,23,42],[20,43,23,56],[21,0,21,7],[21,8,21,37],[22,0,22,7],[22,8,22,37],[23,0,23,7],[23,8,23,37],[24,0,24,7],[24,8,24,37],[24,38,24,42],[24,43,24,56]]}
["Optionales Template: Die Inhalte können auch in geeigneter Form auf andere Art nachgewiesen werden, \ndie spezifischen Inhalte sind zwischen Organisation und Kunde abzustimmen"]
[{"$f":"Sprachen!L341","v":"Teilelebenslauf"},{"$nulls":44},{"$f":"Sprachen!L88","v":"Blatt"},{"$nulls":5},{"$f":"Sprachen!L364","v":"von"},{"$nulls":6},"Sprachauswahl"]
[{"$nulls":13},{"$f":"Sprachen!L255","v":"Organisation"},{"$nulls":23},{"$f":"IF('PPF Abstimmung'!U2<>\"\",'PPF Abstimmung'!U2,\"\")","v":""},{"$nulls":20},{"$f":"'PPF-Bewertung'!AP3","v":"Deutsch"}]
[{"$f":"Sprachen!L46","v":"Angaben zur Organisation"},{"$nulls":27},{"$f":"Sprachen!L45","v":"Angaben zum Kunden"}]
["Lieferstandort",{"$nulls":6},{"$f":"IF('PPF Abstimmung'!H8<>\"\",'PPF Abstimmung'!H8,\"\")","v":""},{"$nulls":6},"Sachnummer",{"$nulls":6},{"$f":"IF('PPF Abstimmung'!H33<>\"\",'PPF Abstimmung'!H33,\"\")","v":""},{"$nulls":6},{"$f":"Sprachen!L187","v":"Kunde"},{"$nulls":6},{"$f":"IF('PPF Abstimmung'!AB5<>\"\",'PPF Abstimmung'!AB5,\"\")","v":""},{"$nulls":8},"Sachnummer",{"$nulls":6},{"$f":"IF('PPF Abstimmung'!AB33<>\"\",'PPF Abstimmung'!AB33,\"\")","v":""}]
["Produktionsstandort",{"$nulls":6},{"$f":"IF('PPF Abstimmung'!H6<>\"\",'PPF Abstimmung'!H6,\"\")","v":""},{"$nulls":6},"Benennung",{"$nulls":6},{"$f":"IF('PPF Abstimmung'!H32<>\"\",'PPF Abstimmung'!H32,\"\")","v":""},{"$nulls":13},{"$f":"IF('PPF Abstimmung'!AB7<>\"\",'PPF Abstimmung'!AB7,\"\")","v":""},{"$nulls":8},"Benennung",{"$nulls":6},{"$f":"IF('PPF Abstimmung'!AB32<>\"\",'PPF Abstimmung'!AB32,\"\")","v":""}]
[{"$f":"Sprachen!L177","v":"Kennung/DUNS"},{"$nulls":6},{"$f":"IF('PPF Abstimmung'!H10<>\"\",'PPF Abstimmung'!H10,\"\")","v":""},{"$nulls":6},{"$f":"Sprachen!L374","v":"Zeichnungsnummer"},{"$nulls":6},{"$f":"IF('PPF Abstimmung'!H34<>\"\",'PPF Abstimmung'!H34,\"\")","v":""},{"$nulls":22},{"$f":"Sprachen!L374","v":"Zeichnungsnummer"},{"$nulls":6},{"$f":"IF('PPF Abstimmung'!AB34<>\"\",'PPF Abstimmung'!AB34,\"\")","v":""}]
[{"$f":"Sprachen!L248","v":"Nr."},null,null,{"$f":"Sprachen!L33","v":"Änd.-Stand Organisation"},null,{"$f":"Sprachen!L389","v":"Änd.-Nummer Organisation"},{"$nulls":4},{"$f":"Sprachen!L32","v":"Änd.-Stand Kunde"},null,{"$f":"Sprachen!L34","v":"Änd.-Nummer Kunde"},{"$nulls":4},{"$f":"Sprachen!L50","v":"Anwen-dung"},null,null,{"$f":"Sprachen!L38","v":"Änderungsbeschreibung"},{"$nulls":10},{"$f":"Sprachen!L272","v":"Produktionsdatum"},{"$nulls":3},{"$f":"Sprachen!L130","v":"Erstlieferdatum"},{"$nulls":3},{"$f":"Sprachen!L178","v":"Kennzeichnung der Lieferung"},{"$nulls":5},{"$f":"Sprachen!L390","v":"Verantwortliche Person"},{"$nulls":5},{"$f":"Sprachen!L61","v":"Bemerkung"}]
[{"$nulls":17},{"$f":"Sprachen!L129","v":"Ersteinsatz"},{"$f":"Sprachen!L270","v":"Produktänderung"},{"$f":"Sprachen!L285","v":"Prozessänderung"}]
[1,{"$nulls":57},{"$f":"COUNTIF(R10:T10,\"X\")","v":0}]
[2,{"$nulls":57},0]
[3,{"$nulls":57},0]
[4,{"$nulls":57},0]
[5,{"$nulls":57},0]
[6,{"$nulls":57},0]
[7,{"$nulls":57},0]
[8,{"$nulls":57},0]
[9,{"$nulls":57},0]
[10,{"$nulls":57},0]
[{"$f":"Sprachen!L84","v":"Bestätigung Organisation"}]
[{"$f":"Sprachen!L234","v":"Name"},{"$nulls":7},{"$f":"IF('Selbstb. Produkt '!I28<>\"\",'Selbstb. Produkt '!I28,\"\")","v":""},{"$nulls":29},{"$f":"Sprachen!L61","v":"Bemerkung"}]
[{"$f":"Sprachen!L20","v":"Abteilung"},{"$nulls":7},{"$f":"IF('Selbstb. Produkt '!I29<>\"\",'Selbstb. Produkt '!I29,\"\")","v":""}]
[{"$f":"Sprachen!L343","v":"Telefon"},{"$nulls":7},{"$f":"IF('Selbstb. Produkt '!I30<>\"\",'Selbstb. Produkt '!I30,\"\")","v":""}]
[{"$f":"Sprachen!L119","v":"E-Mail/Fax-Nr."},{"$nulls":7},{"$f":"IF('Selbstb. Produkt '!I31<>\"\",'Selbstb. Produkt '!I31,\"\")","v":""}]
[{"$f":"Sprachen!L91","v":"Datum"},{"$nulls":7},{"$f":"IF('Selbstb. Produkt '!I32<>\"\",'Selbstb. Produkt '!I32,\"\")","v":""},{"$nulls":29},{"$f":"Sprachen!L348","v":"Unterschrift"}]